Gentoo Websites Logo
Go to: Gentoo Home Documentation Forums Lists Bugs Planet Store Wiki Get Gentoo!
Votes Bug # Summary
Gentoo Hosted Projects (bug list)
1 516902 app-admin/eselect with app-shells/zsh-completion-20130808 - !!! Error: Unknown option --no-color exiting _values:compvalues:10: not enough arguments (Show Votes)
1 vote used out of 5 allowed.

Gentoo Infrastructure (bug list)
1 357685 Bug numbers in the attachment links (Show Votes)
1 365947 "Bug ### Some or all of your votes have been removed." (Show Votes)
1 565694 sys-apps/busybox - Filesize does not match recorded size (Show Votes)
3 votes used out of 5 allowed.

Gentoo Linux (bug list)
1 121709 PCL input for cups - ghostpdl/ghostxps ebuild (Show Votes)
1 130612 canon cups capt driver (new ebuild) (Show Votes)
1 374057 package "x" lacks gtk2 ebuild support in favor of gtk3 (Show Votes)
1 379345 logrotate skips summary.log because of insecure (group write) permissions (Show Votes)
1 384525 app-admin/python-updater-0.9{,-r1} constantly rebuilds a few packages (Show Votes)
1 390399 icedtea-bin-1.10.4 always redownloads web start application (Show Votes)
1 397965 dev-util/visualvm-1.3.3-r1 Cannot find $EPATCH_SOURCE (Show Votes)
1 405149 Stabilize =net-dns/bind-9.8.1_p1 (Show Votes)
1 406187 sys-libs/talloc-2.0.8 - [Errno 2] No such file or directory: '/var/tmp/portage/sys-libs/talloc-2.0.7/work/talloc-2.0.7/bin/default/lib/replace/getpass_2.d' (Show Votes)
1 409283 >=media-gfx/blender-2.49a with media-libs/openjpeg-1.5.0 - In function ‘cinema_parameters’: source/blender/imbuf/intern/jp2.c:331:29: error: ‘false’ undeclared (first use in this function) (Show Votes)
1 409691 media-gfx/blender-2.49b-r2 - In function ‘cinema_parameters’: source/blender/imbuf/intern/jp2.c:331:29: error: ‘false’ undeclared (first use in this function) (Show Votes)
1 444762 sys-devel/gcc: multilib libjava wants 32bit jack (Show Votes)
1 447266 =app-text/ghostpdl-9.06 - New package. - GhostPCL, GhostXPS, Ghostscript and GhostPDF Interpreters (Show Votes)
1 448560 =media-sound/lilypond-2.16.1 - sandbox violation in mkdir ././var/cache/fonts/tfm (Show Votes)
1 466768 x11-base/xorg-server - X crashes with a segfault - (EE) 2: linux-gate.so.1 (__kernel_rt_sigreturn+0x0) [0xffffe40c] while processing input events. (Show Votes)
1 468294 media-sound/alsa-tools-1.0.27-r1 should not depend on both x11-libs/gtk+:2 and x11-libs/gtk+:3 (Show Votes)
1 472554 =dev-db/pgadmin3-1.16.1-r1 crashes very often in the query window (Show Votes)
1 475450 media-sound/mpd-0.17.4-r2 crashes on boot (Show Votes)
1 476410 =x11-drivers/xf86-video-virtualbox-4.2.16 FEATURES=distcc - g++: error: missing filename after '-o' (Show Votes)
1 484754 sys-apps/util-linux[pam]: should install /etc/pam.d/runuser and /etc/pam.d/runuser-l (Show Votes)
1 485994 media-libs/fontconfig-2.10.92 breaks on-screen-display in media-video/mplayer2-2.0_p20130126 (Show Votes)
1 486042 =dev-java/icedtea-bin-7.2.4.1 - java: Exception in thread "main" java.lang.UnsatisfiedLinkError: /opt/icedtea-bin-7.2.4.1/jre/lib/amd64/headless/libmawt.so: libcups.so.2: cannot open shared object file: No such file or directory (Show Votes)
1 491430 app-shells/zsh-completion-20130808 uses deprecated eselect options (Show Votes)
1 515888 media-sound/denemo-2.2.0 version bump (Show Votes)
1 522296 dev-java/icedtea-bin needs media-libs/lcms:2 as RDEPEND (Show Votes)
1 533328 app-admin/syslog-ng-3.6.2: scary time stamp jumps (Show Votes)
1 538224 www-client/chromium-42.0.2288.6 USE=-gnome-keyring should not depend on app-crypt/libsecret (Show Votes)
1 547186 media-sound/denemo-1.0.2 :pitchrecog.c:192:27: error: subscripted value is neither array nor pointer nor vector (Show Votes)
1 547918 dev-java/openjfx: next generation client application platform (Show Votes)
1 553122 sys-apps/util-linux-2.25.2-r2: runuser: Failure setting user credentials (Show Votes)
1 554908 >=net-misc/openvpn-2.3.7: passphrase for key is not requested (Show Votes)
1 562568 =app-text/pdftk-2.02 calls gcj directly (Show Votes)
1 568128 kde-apps/kwalletmanager-4.14 asks me to choose a password twice (Show Votes)
1 575978 dev-java/oracle-jdk-bin-1.8.0.74: can't play videos with JavaFX (Show Votes)
1 585048 sys-apps/texinfo-6.1 has weird build system, likely causing unneeded perl-cleaner rebuilds (Show Votes)
1 586020 dev-lang/perl: dev-perl/Unicode-EastAsianWidth rebuild issues (sys-apps/texinfo-6.1 : Compilation failed in require at ../tp/Texinfo/Convert/Text.pm line 27.) (Show Votes)
1 589940 net-analyzer/nikto-2.1.5 fails to run declaring Undefined Subroutine &LW2 (Show Votes)
1 591086 x11-plugins/pidgin-skypeweb-1.2.2 version bump (Show Votes)
1 597928 dev-java/icedtea-bin-3.1.0 does not support JavaFX (Show Votes)
1 605532 net-im/pidgin-2.11.0-r1 no system tray icon with KDE 5 (Show Votes)
1 605780 sci-astronomy/stellarium-0.15.1 : make[2]: *** No rule to make target '/var/tmp/portage/sci-astronomy/stellarium-0.15.1/work/stellarium-0.15.1/po/stellarium-remotecontrol/hi.po', needed by 'translations/stellarium-remotecontrol/hi.qm'. Stop. (Show Votes)
1 609716 =media-gfx/blender-2.72b-r4 fails to build with media-video/ffmpeg-3 - error: ‘avcodec_alloc_frame’ was not declared in this scope (Show Votes)
1 612788 sys-devel/binutils-2.25.1-r1: circular preserved-rebuild (Show Votes)
1 638294 media-libs/gst-plugins-bad-1.12.3: please stabilize on AMD64 (Show Votes)
1 641966 app-misc/anki-2.1.0_beta25 missing qtwebengine and other issues (Show Votes)
1 647074 games-simulation/openttd-1.7.2 build fails after icu upgrade to 60.2: undefined reference to icu::LEFontInstance::getSubFont (Show Votes)
1 662658 games-strategy/warmux-11.04.1-r1 : /.../fribidi-types.h:31:11: fatal error: config.h: No such file or directory (Show Votes)
1 662962 media-libs/quesoglc-0.7.2 : /.../fribidi-types.h:31:11: fatal error: config.h: No such file or directory (Show Votes)
1 664526 dev-vcs/tortoisehg-4.7 : file collision with dev-vcs/mercurial-4.7 (Show Votes)
1 678432 media-fonts/noto should add USE flags to limit size of installed contents (Show Votes)
50 votes used out of 50 allowed.

Mirrors (bug list)
1 473870 mirrorstats not updated (Show Votes)
1 507448 Mirrorstats is down (Show Votes)
2 votes used out of 5 allowed.

Portage Development (bug list)
1 377889 equery depends does not display || dependencies (Show Votes)
1 382231 app-portage/gentoolkit-0.3.0.4 euse -i has undocumented output (Show Votes)
1 390749 app-portage/portage-utils: qdepends: parse searches as atoms when appropriate (Show Votes)
1 427938 sys-apps/portage: emerge ignores optional build-time only dependencies when updating system (Show Votes)
1 431978 sys-apps/portage: FEATURES=preserve-libs missed dependency (libmpc.so.2) in /usr/libexec/gcc/x86_64-pc-linux-gnu/4.7.1/cc1 (Show Votes)
1 444894 sys-apps/portage: emerge --tree should display the most relevant parent (Show Votes)
1 505160 app-portage/gentoolkit-0.3.0.9 - euse - WARNING: 'portageq envvar PORTDIR' is deprecated. Use 'portageq repositories_configuration' instead. (Show Votes)
1 588642 PORTAGE_BZIP2_COMMAND setting is invalid: 'bzip2' (Show Votes)
1 658326 Poor handling of texlive-core dependency on older freetype (Show Votes)
9 votes used out of 10 allowed.

View all as bug list

Help with voting.