Gentoo Websites Logo
Go to: Gentoo Home Documentation Forums Lists Bugs Planet Store Wiki Get Gentoo!
Votes Bug # Summary
Gentoo Linux (bug list)
1 49282 [science overlay] sci-mathematics/gap-4.4.10.ebuild (New Package) (Show Votes)
1 228131 boost-numeric-bindings-20080610.ebuild (New Package) (Show Votes)
1 259181 Numpty Physics [new package] (Show Votes)
1 280341 app-portage/gentoolkit: revdep-rebuild fails to find owning package of some files in /usr/lib64 (Show Votes)
1 333531 [TRACKER] portage migration to git (Show Votes)
1 337583 kde-base/system-config-printer-kde-4.6.2 fails to build (Show Votes)
1 339617 xf86-video-ati-6.13.2 slow (Show Votes)
1 379177 dev-tex/pdftex-1.40.10 ttf2afm.c:(.text+0x35e1): undefined reference to `kpse_set_progname' (Show Votes)
1 383051 dev-cpp/eigen-3.0.2 requires pressing Enter to build (Show Votes)
1 406849 dev-libs/soprano-2.7.4 fails to build with USE=doc (Show Votes)
1 422989 Please unmask and mark stable =net-libs/telepathy-farstream-0.2.3 (Show Votes)
1 506136 media-gfx/blender-2.70 depends on package.masked media-video/ffmpeg-2.1.4 (Show Votes)
1 508254 dev-lang/swig-3.0.0 version bump (Show Votes)
1 575230 net-libs/opal-3.10.11 : h263-1998.cxx:243:24: error: ‘PIX_FMT_YUV420P’ was not declared in this scope (Show Votes)
1 581904 sys-boot/grub: grub2-mkconfig generates invalid grub.conf when using btrfs multidevice (Show Votes)
1 613900 games-action/bzflag-2.4.4 fails unless sys-libs/ncurses is built with USE="-tinfo" (Show Votes)
1 617788 sys-devel/gcc-7.2.0[multilib,obj-gc]: missing abi DEPEND on dev-libs/boehm-gc: configure: error: system bdw-gc required but not found (Show Votes)
1 621532 net-libs/webkit-gtk-2.4.11-r200 with dev-libs/icu-59 - Source/JavaScriptCore/API/JSStringRef.cpp:86:30: error: invalid conversion from ‘const UChar* {aka const char16_t*}’ to ‘const JSChar* {aka const short unsigned int*}’ [-fpermissive] (Show Votes)
1 636344 dev-tex/latex2html-2015: Can't locate in @INC (Show Votes)
1 638666 sys-devel/gcc-7.2.0 - checking host system type... configure: error: system bdw-gc required but not found (Show Votes)
1 641184 dev-libs/libtommath-1.0.1 - OSError: [Errno 2] No such file or directory: '*.pdf' (Show Votes)
1 650304 dev-libs/cloog-0.18.4 with >=dev-libs/isl-0.19: …/ undefined reference to `isl_basic_set_drop_constraint' (Show Votes)
1 650388 x11-libs/gtk+:3: app-office/gnucash segfaults on keyboard input (GTK_IM_MODULE, gdk_window_has_impl) (Show Votes)
1 651658 dev-util/kdevelop:5 and media-libs/mesa-17*[llvm] link with different slots of sys-devel/llvm, resulting in a runtime symbol conflict and crash (Show Votes)
1 657472 www-client/chromium-68.0.3438.3: compilation errors with gcc-6.4.0 (Show Votes)
1 658136 kde-apps/lokalize all versions add Python 3.6 support (Show Votes)
1 659480 [ICE/7] sys-devel/gcc-7.3.0 with -std=c++17: internal compiler error in /usr/include/glm/gtc/quaternion.hpp (Show Votes)
1 666324 =media-gfx/inkscape-0.92.3-r1 depends on >=dev-cpp/glibmm-2.54.1: configure: error: cannot detect whether C++11 is required (Show Votes)
1 670562 dev-libs/libmspack-0.9_alpha - FileNotFoundError: [Errno 2] No such file or directory: b'doc/*' (Show Votes)
1 671130 sci-mathematics/Macaulay2- fails to build at "make -C flint fetch" (Show Votes)
1 671270 sys-devel/gcc-4.5.4 and sys-devel/gcc-4.7.4-r1 fail to build with error: field ‘uc’ has incomplete type (Show Votes)
1 672634 media-libs/allegro- : /.../xglx_config.c:495:42: error: glXCreateContextAttribsARB undeclared (first use in this function) (Show Votes)
1 673390 net-libs/daq-2.0.6 build fails with ./scanner.l:70:10: fatal error: tokdefs.h: No such file or directory (Show Votes)
1 676238 games-strategy/glob2- : NameError: global name Options is not defined: (Show Votes)
1 687552 dev-libs/glib-2.58.3 - configure: error: *** Could not find libmount (Show Votes)
1 689740 media-gfx/blender-2.83.1: version bump (Show Votes)
1 691828 dev-tex/xcolor-2.12-r1[doc] with dev-tex/pgf-3.1.4 fails to build documentation (Show Votes)
1 692478 net-analyzer/net-snmp-5.8-r1 with dev-db/mysql-connector-c-8.* : snmptrapd_sql.c:202:8: error: unknown type name 'my_bool' (Show Votes)
1 700852 app-office/abiword-3.0.2-r2 with =dev-cpp/asio-1.10.8 - In file included from ServiceUnixAccountHandler.cpp:20: ./../../../backends/service/xp/ServiceAccountHandler.h:152:28: error: ‘error’ is not a member of ‘asio::placeholders’ (Show Votes)
1 703778 dev-python/paramiko-2.7.1 failed to emerge with USE=doc (Show Votes)
1 704550 net-libs/webkit-gtk-2.26.2 - src_compile(): Exception: gtkdoc-mkhtml produced a non-zero return code 6 (Show Votes)
1 704630 dev-tex/latex2html-2017.2 stabilization request (Show Votes)
1 705408 www-client/firefox-72.0.1[lto] frequent crashes in (Show Votes)
1 707940 app-office/gnucash-3.5 - CMake Error at gnucash/register/register-gnome/CMakeLists.txt:4 (check_symbol_exists): Unknown CMake command "check_symbol_exists". (Show Votes)
1 709418 games-strategy/freeorion-0.4.9 version bump (Show Votes)
1 717152 games-strategy/openra-20200503: version bump (Show Votes)
46 votes used out of 50 allowed.

Portage Development (bug list)
1 256765 Support for .xz file format in (Show Votes)
1 340287 sys-apps/portage-2.2_rc91: --keep-going sometimes fails to work (Show Votes)
1 618866 sys-apps/portage-2.3.5: emerge --keep-going dropping pkgs unrelated to the failures (Show Votes)
3 votes used out of 10 allowed.

View all as bug list

Help with voting.