Gentoo Websites Logo
Go to: Gentoo Home Documentation Forums Lists Bugs Planet Store Wiki Get Gentoo!
Votes Bug # Summary
Gentoo Hosted Projects (bug list)
1 414817 [Future EAPI] Support for make.defaults, use.force, use.stable.force, use.mask, use.stable.mask, package.use, package.use.force, package.use.stable.force, package.use.mask and package.use.stable.mask in ${repository_path}/profiles (Show Votes)
1 vote used out of 5 allowed.

Gentoo Infrastructure (bug list)
1 406445 Add "My Votes" link (Show Votes)
1 vote used out of 5 allowed.

Gentoo Linux (bug list)
1 44132 sys-cluster/{mpich2,openmpi}, lam-mpi, etc... - Allow packages to be simultaneously installed. (Show Votes)
1 201321 sci-mathematics/sage (new ebuild) (Show Votes)
1 253881 sci-visualisation/paraview bundles an internal copy of sci-libs/vtk (Show Votes)
1 448882 [Tracker] packages not providing systemd units (Show Votes)
1 470910 sys-apps/util-linux - uuidd: make optional, add openrc script (Show Votes)
1 528674 [TRACKER] Support systemd with SELinux (Show Votes)
1 603080 Feature Request: Profile for hardened + systemd (Show Votes)
1 616022 sys-process/systemd-cron-1.5.4 : file collision with sys-process/anacron-2.3-r4 (Show Votes)
1 620524 sys-apps/install-xattr: setxattr() failed: Operation not permitted - on hardened profile with FEATURES="userpriv" during src_compile as opposed to src_install (Show Votes)
1 640322 dev-lisp/gcl-2.6.10 - main.c: In function 'main': main.c:451:32: error: storage size of 'estack' isn't known (Show Votes)
1 694118 dev-lang/open-cobol-1.1 with sys-libs/ncurses[tinfo] - ../libcob/.libs/libcob.so: error: undefined reference to 'cbreak' (Show Votes)
1 697736 sys-cluster/knem-1.1.3 USE=modules - .../work/knem-1.1.3/driver/linux/knem_main.c:2874:36: error: ‘struct task_struct’ has no member named ‘cpus_allowed’; did you mean ‘mems_allowed’? (Show Votes)
1 698994 sys-cluster/slurm-19.05.3.2 - slurmd: error: plugin_load_from_file: dlopen(/usr/lib64/slurm/select_linear.so): /usr/lib64/slurm/select_linear.so: undefined symbol: slurm_job_preempt_mode (Show Votes)
1 720046 sys-cluster/slurm-19.05.5.1-r1 service doesn't start when /bin/sh is a symlink to dash (Show Votes)
1 728210 dev-ruby/racc-1.4.16-r1 - /usr/lib64/ruby/2.4.0/rubygems.rb:17:in `require': cannot load such file -- rubygems/compatibility (LoadError) (Show Votes)
1 744622 media-sound/pulseaudio, media-video/pipewire: Allow replacing pulseaudio sound server with pipewire sound server (Show Votes)
1 765865 dev-ros/qt_gui_cpp-0.4.2-r1 : make[2]: *** [src/.../build.make:109: sip/qt_gui_cpp_sip/Makefile] Error 1 (Show Votes)
1 774750 acct-user/nobody systemd[1]: /lib/systemd/system/cron-failure@.service:11: Special user nobody configured, this is not safe! (Show Votes)
1 776979 net-libs/webkit-gtk-2.30.5 error: unknown argument '-Wl,-O1' (Show Votes)
1 777438 dev-ros/visp_tracker-0.11.1 rospkg.common.ResourceNotFound: visp_tracker (Show Votes)
1 778044 app-misc/elasticsearch-7.10.2 elasticsearch-systemd-pre-exec[4614]: could not find java in bundled jdk at /usr/share/elasticsearch/jdk/bin/java (Show Votes)
1 778572 sci-electronics/ngspice-34 - options.c:(.text+<snip>): multiple definition of cp_enqvar; ngsconvert.o:ngsconvert.c:(.text+<snip>): (Show Votes)
1 779877 app-i18n/mozc-2.26.4220* fails to build with >=dev-cpp/abseil-cpp-20210324 (Show Votes)
1 781242 dev-lang/julia-1.6.0 build fails due to a missing library dependence in libsuitesparseconfig.so (Show Votes)
1 784275 dev-java/aspectj please provide the aspectj compiler (ajc) (Show Votes)
1 789552 sci-visualization/paraview license review (Show Votes)
1 789984 sys-cluster/ucx-1.10.0_rc5 - Package 'knem', required by 'virtual:world', not found - checking whether KNEM_CMD_GET_INFO is declared... no (Show Votes)
1 792486 sci-physics/root unbundle the microsoft corefonts for free licensing (Show Votes)
1 796131 sys-cluster/gasnet-1.30.0 sandbox access violation (Show Votes)
1 797700 media-gfx/freecad-0.19.2-r2 ModuleNotFoundError: No module named 'mpi4py' (Show Votes)
1 814845 sci-libs/ginkgo-1.4.0 - configure fails: Could not find a package configuration file provided by "hipblas" (Show Votes)
1 815421 sci-visualization/veusz-3.3.1 - error: command .../sip failed with exit code 1 (Show Votes)
1 818505 dev-ada/libgpr rename libgpr.so to libgnatprj.so to avoid clash with net-libs/grpc (Show Votes)
1 822486 dev-ros/rviz-1.14.8-r1 - sip: .../QtCoremod.sip:23: syntax error (Show Votes)
1 823005 dev-python/sip: crash in sipbuild/code_generator.abi3.so when building sci-visualization/veusz (*** longjmp causes uninitialized stack frame ***: terminated) (Show Votes)
1 829266 dev-ros/joint_limits_interface-0.19.5 - CMake Error at .../urdfConfig.cmake:173 (message): (Show Votes)
1 829291 dev-ros/robot_state_publisher-1.15.1 - CMake Error at .../urdfConfig.cmake:173 (message): (Show Votes)
1 831663 sci-visualization/veusz-3.3.1-r1 /var/tmp/portage/sci-visualization/veusz-3.3.1-r1/temp/environment: line 3065: 124 Segmentation fault "${@}" (Show Votes)
1 831868 sci-mathematics/rstudio-1.3.1093-r1 fails to compile: catch.hpp:6470:21: error: variable length array declaration not allowed at file scope (Show Votes)
1 832781 dev-ros/pcl_ros-1.7.2-r1 Project 'pcl_ros' tried to find library '$<LINK_ONLY:VTK::FiltersStatistics>'. The library is neither a target nor built/installed properly. (Show Votes)
1 832865 app-accessibility/mbrola-3.3-r1 lift multilib restriction (Show Votes)
1 839258 dev-db/firebird rename gstat to avoid collision with sys-cluster/ganglia (Show Votes)
1 840320 app-arch/dpkg-1.21.1 please provide a vendor file for dpkg-vendor (Show Votes)
1 843227 app-i18n/mozc-2.26.4660.102 please bump (Show Votes)
1 847451 net-misc/curl-7.83.1 - configure: error: couldnt use quiche (Show Votes)
1 847583 net-libs/quiche-0.1[34].0: installs non-functional libquiche.so, breaks curl, fwupd, ... (Show Votes)
1 847922 sci-mathematics/petsc-3.17.1 provide petsc4py (Show Votes)
1 849002 sci-libs/pcl-1.12.1[doc] no theme named 'sphinx_rtd_theme' found (missing theme.conf?) (Show Votes)
1 852236 sci-libs/rocBLAS-5.0.2 doesn't respect MAKEOPTS (Show Votes)
49 votes used out of 50 allowed.

Portage Development (bug list)
1 539418 sys-apps/portage: support sync module option to 'git reset' before pulling (Show Votes)
1 570472 sys-apps/portage: allow to depclean in parallel (Show Votes)
1 574130 Misleading error message "Repoman: Need user access" (Show Votes)
1 696080 BINPKG_COMPRESS=xz packages created with extension .tbz2 (Show Votes)
1 771360 sys-apps/sandbox: please allow sandbox to work with kernel.yama.ptrace_scope = 2 (i.e. disabling ptrace) (Show Votes)
1 821499 launching sandbox as non-root should retain CAP_SYS_PTRACE capabilities to bypass yama ptrace_scope (Show Votes)
6 votes used out of 10 allowed.

View all as bug list

Help with voting.