Gentoo Websites Logo
Go to: Gentoo Home Documentation Forums Lists Bugs Planet Store Wiki Get Gentoo!
Bug 667488 - dev-php/pecl-http-3.1.0-r2: test failures
Summary: dev-php/pecl-http-3.1.0-r2: test failures
Status: RESOLVED FIXED
Alias: None
Product: Gentoo Linux
Classification: Unclassified
Component: Current packages (show other bugs)
Hardware: All Linux
: Normal normal (vote)
Assignee: PHP Bugs
URL:
Whiteboard:
Keywords: TESTFAILURE
Depends on:
Blocks: 667080
  Show dependency tree
 
Reported: 2018-10-01 17:48 UTC by Thomas Deutschmann
Modified: 2021-09-22 14:53 UTC (History)
0 users

See Also:
Package list:
Runtime testing required: ---


Attachments
build.log (build.log,186.91 KB, text/plain)
2018-10-01 17:48 UTC, Thomas Deutschmann
Details
test logs (logs.tar.xz,3.43 KB, application/x-xz)
2018-10-01 17:52 UTC, Thomas Deutschmann
Details

Note You need to log in before you can comment on or make changes to this bug.
Description Thomas Deutschmann gentoo-dev Security 2018-10-01 17:48:22 UTC
Created attachment 548742 [details]
build.log

> =====================================================================
> TEST RESULT SUMMARY
> ---------------------------------------------------------------------
> Exts skipped    :    0
> Exts tested     :   31
> ---------------------------------------------------------------------
> 
> Number of tests :  194               163
> Tests skipped   :   31 ( 16.0%) --------
> Tests warned    :    0 (  0.0%) (  0.0%)
> Tests failed    :   24 ( 12.4%) ( 14.7%)
> Expected fail   :    0 (  0.0%) (  0.0%)
> Tests passed    :  139 ( 71.6%) ( 85.3%)
> ---------------------------------------------------------------------
> Time taken      :   15 seconds
> =====================================================================
> 
> =====================================================================
> FAILED TEST SUMMARY
> ---------------------------------------------------------------------
> Bug #66388 (Crash on POST with Content-Length:0 and untouched body) [tests/bug66388.phpt]
> Bug #69313 (http\Client doesn't send GET body) [tests/bug69313.phpt]
> Bug #69357 (HTTP/1.1 100 Continue overriding subsequent 200 response code with PUT request) [tests/bug69357.phpt]
> client observer [tests/client002.phpt]
> client once & wait [tests/client003.phpt]
> client reset [tests/client004.phpt]
> client response callback [tests/client005.phpt]
> client response callback + dequeue [tests/client006.phpt]
> client response callback + requeue [tests/client007.phpt]
> client configuration [tests/client008.phpt]
> client ssl [tests/client012.phpt]
> client observers [tests/client013.phpt]
> http client event base [tests/client015.phpt]
> client once & wait with events [tests/client016.phpt]
> client pipelining [tests/client018.phpt]
> client proxy - send proxy headers for a proxy request [tests/client019.phpt]
> client proxy - don't send proxy headers for a standard request [tests/client020.phpt]
> client cookies [tests/client021.phpt]
> client seek [tests/client025.phpt]
> client stream 128M [tests/client026.phpt]
> client cookie woes [tests/client027.phpt]
> client curl user handler [tests/client028.phpt]
> client eventloop recursion [tests/client030.phpt]
> client response transfer info [tests/clientresponse003.phpt]
> =====================================================================
> make: *** [Makefile:138: test] Error 1
>  * ERROR: dev-php/pecl-http-3.1.0-r2::gentoo failed (test phase):
>  *   emake failed


Portage 2.3.49 (python 3.6.5-final-0, default/linux/x86/17.0, gcc-7.3.0, glibc-2.26-r7, 4.14.65-gentoo i686)
=================================================================
System uname: Linux-4.14.65-gentoo-i686-Intel-R-_Core-TM-_i7-3770K_CPU_@_3.50GHz-with-gentoo-2.4.1
KiB Mem:     3107592 total,    506720 free
KiB Swap:     488276 total,    424824 free
Timestamp of repository gentoo: Sun, 30 Sep 2018 23:24:24 +0000
Head commit of repository gentoo: ffa54851a4c843b9f584c74d6f918f5132421975

sh bash 4.4_p12
ld GNU ld (Gentoo 2.30 p5) 2.30.0
app-shells/bash:          4.4_p12::gentoo
dev-java/java-config:     2.2.0-r4::gentoo
dev-lang/perl:            5.24.3-r1::gentoo
dev-lang/python:          2.7.15::gentoo, 3.6.5::gentoo
dev-util/cmake:           3.9.6::gentoo
dev-util/pkgconfig:       0.29.2::gentoo
sys-apps/baselayout:      2.4.1-r2::gentoo
sys-apps/openrc:          0.38.2::gentoo
sys-apps/sandbox:         2.13::gentoo
sys-devel/autoconf:       2.13::gentoo, 2.69-r4::gentoo
sys-devel/automake:       1.15.1-r2::gentoo
sys-devel/binutils:       2.30-r4::gentoo
sys-devel/gcc:            7.3.0-r3::gentoo
sys-devel/gcc-config:     1.8-r1::gentoo
sys-devel/libtool:        2.4.6-r3::gentoo
sys-devel/make:           4.2.1-r4::gentoo
sys-kernel/linux-headers: 4.13::gentoo (virtual/os-headers)
sys-libs/glibc:           2.26-r7::gentoo
Repositories:

gentoo
    location: /usr/portage
    sync-type: git
    sync-uri: https://github.com/gentoo-mirror/gentoo.git
    priority: -1000

ABI="x86"
ABI_X86="32"
ACCEPT_KEYWORDS="x86"
ACCEPT_LICENSE="* -@EULA"
ACCEPT_PROPERTIES="*"
ACCEPT_RESTRICT="*"
ARCH="x86"
BROOT=""
CBUILD="i686-pc-linux-gnu"
CFLAGS="-O2 -pipe -march=pentium4m -mtune=pentium4m"
CHOST="i686-pc-linux-gnu"
CHOST_x86="i686-pc-linux-gnu"
COLLISION_IGNORE="/lib/modules/*"
CONFIG_PROTECT="/etc /usr/share/config /usr/share/gnupg/qualified.txt"
CPU_FLAGS_X86="mmx mmxext sse sse2"
CXXFLAGS="-O2 -pipe -march=pentium4m -mtune=pentium4m"
DEFAULT_ABI="x86"
EDITOR="/usr/bin/mcedit"
ELIBC="glibc"
ENV_UNSET="DBUS_SESSION_BUS_ADDRESS DISPLAY PERL5LIB PERL5OPT PERLPREFIX PERL_CORE PERL_MB_OPT PERL_MM_OPT XAUTHORITY XDG_CACHE_HOME XDG_CONFIG_HOME XDG_DATA_HOME XDG_RUNTIME_DIR"
EPREFIX=""
EROOT="/"
ESYSROOT="/"
FCFLAGS="-O2 -march=i686 -pipe"
FEATURES="assume-digests binpkg-logs cgroup config-protect-if-modified distlocks downgrade-backup ebuild-locks fixlafiles merge-sync multilib-strict news parallel-fetch preserve-libs protect-owned sandbox sfperms strict unknown-features-warn unmerge-logs unmerge-orphans userfetch userpriv usersandbox usersync xattr"
FFLAGS="-O2 -march=i686 -pipe"
GCC_SPECS=""
GRUB_PLATFORMS="efi-32 pc"
GSETTINGS_BACKEND="dconf"
HOME="/root"
INFOPATH="/usr/share/gcc-data/i686-pc-linux-gnu/7.3.0/info:/usr/share/binutils-data/i686-pc-linux-gnu/2.30/info:/usr/share/info"
INPUT_DEVICES="libinput keyboard mouse"
IUSE_IMPLICIT="abi_x86_32 prefix prefix-chain prefix-guest"
KERNEL="linux"
L10N="en en-US de de-DE"
LANG="en_US.UTF-8"
LC_ALL="en_US.UTF-8"
LC_MESSAGES="C"
LC_PAPER="de_DE.UTF-8"
LDFLAGS="-Wl,-O1 -Wl,--as-needed"
LIBDIR_x86="lib"
LINGUAS="en de"
LOGNAME="root"
MAIL="/var/mail/root"
MAKEOPTS="--jobs 5 --load-average 7.95"
MULTILIB_ABIS="x86"
NOCOLOR="true"
OFFICE_IMPLEMENTATION="libreoffice"
OLDPWD="/usr/portage/app-editors/emacs"
OPENCL_PROFILE="mesa"
OPENGL_PROFILE="xorg-x11"
PAGER="/usr/bin/less"
PATH="/usr/i686-pc-linux-gnu/gcc-bin/7.3.0:/usr/lib/llvm/6/bin:/usr/local/sbin:/usr/local/bin:/usr/sbin:/usr/bin:/sbin:/bin:/opt/bin"
PHP_TARGETS="php5-6 php7-0 php7-1"
POSTGRES_TARGETS="postgres9_5 postgres10"
PWD="/tmp"
PYTHONDONTWRITEBYTECODE="1"
PYTHON_SINGLE_TARGET="python3_6"
PYTHON_TARGETS="python2_7 python3_6"
QT_GRAPHICSSYSTEM="raster"
ROOT="/"
ROOTPATH="/usr/i686-pc-linux-gnu/gcc-bin/7.3.0:/usr/lib/llvm/6/bin:/usr/local/sbin:/usr/local/bin:/usr/sbin:/usr/bin:/sbin:/bin:/opt/bin"
RUBY_TARGETS="ruby22 ruby23"
SHELL="/bin/bash"
SHLVL="2"
SSH_TTY="/dev/pts/0"
SYSROOT="/"
TERM="tmux-256color"
TMUX="/tmp//tmux-0/default,5510,0"
TMUX_PANE="%3"
TWISTED_DISABLE_WRITING_OF_PLUGIN_CACHE="1"
USER="root"
USERLAND="GNU"
VIDEO_CARDS="vmware"
XDG_CONFIG_DIRS="/etc/xdg"
XDG_DATA_DIRS="/usr/local/share:/usr/share"
Comment 1 Thomas Deutschmann gentoo-dev Security 2018-10-01 17:52:15 UTC
Created attachment 548758 [details]
test logs
Comment 2 Pacho Ramos gentoo-dev 2019-03-15 10:29:18 UTC
are they still broken with 3.2.0?
Comment 3 Pacho Ramos gentoo-dev 2019-06-03 13:18:26 UTC
it still fails :S
=====================================================================
TIME END 2019-06-03 13:13:56

=====================================================================
TEST RESULT SUMMARY
---------------------------------------------------------------------
Exts skipped    :    0
Exts tested     :   36
---------------------------------------------------------------------

Number of tests :  202               199
Tests skipped   :    3 (  1.5%) --------
Tests warned    :    0 (  0.0%) (  0.0%)
Tests failed    :   10 (  5.0%) (  5.0%)
Expected fail   :    0 (  0.0%) (  0.0%)
Tests passed    :  189 ( 93.6%) ( 95.0%)
---------------------------------------------------------------------
Time taken      :  133 seconds
=====================================================================

=====================================================================
FAILED TEST SUMMARY
---------------------------------------------------------------------
client configuration [tests/client008.phpt]
client static cookies [tests/client009.phpt]
client upload [tests/client010.phpt]
client history [tests/client011.phpt]
client ssl [tests/client012.phpt]
client request gzip [tests/client017.phpt]
client pipelining [tests/client018.phpt]
client response cookie [tests/clientresponse001.phpt]
client response cookies [tests/clientresponse002.phpt]
segfault with Client::setDebug and Client::dequeue() [tests/gh-issue50.phpt]
=====================================================================
make: *** [Makefile:138: test] Error 1
Comment 4 Brian Evans Gentoo Infrastructure gentoo-dev 2019-12-05 18:52:19 UTC
With 3.2.1:

=====================================================================
TEST RESULT SUMMARY
---------------------------------------------------------------------
Exts skipped    :    0
Exts tested     :   47
---------------------------------------------------------------------

Number of tests :  202               172
Tests skipped   :   30 ( 14.9%) --------
Tests warned    :    0 (  0.0%) (  0.0%)
Tests failed    :    1 (  0.5%) (  0.6%)
Expected fail   :    0 (  0.0%) (  0.0%)
Tests passed    :  171 ( 84.7%) ( 99.4%)
---------------------------------------------------------------------
Time taken      :   35 seconds
=====================================================================

=====================================================================
FAILED TEST SUMMARY
---------------------------------------------------------------------
client ssl [tests/client012.phpt]
=====================================================================

$ cat /var/tmp/portage/dev-php/pecl-http-3.2.1/work/php7.1/tests/client012.diff
003+
004+ Notice: http\Client::enqueue(): Could not set option enable_npn (An unknown option was passed in to libcurl) in /var/tmp/portage/dev-php/pecl-http-3.2.1/work/php7.1/tests/client012.php on line 29
005+
006+ Notice: http\Client::enqueue(): Could not set option ssl (An unknown option was passed in to libcurl) in /var/tmp/portage/dev-php/pecl-http-3.2.1/work/php7.1/tests/client012.php on line 29
Comment 5 Brian Evans Gentoo Infrastructure gentoo-dev 2021-09-22 14:53:45 UTC
Tests are passing as of 3.2.4-r1 and 4.2.1