Gentoo Websites Logo
Go to: Gentoo Home Documentation Forums Lists Bugs Planet Store Wiki Get Gentoo!
Bug 907345 - media-libs/openimageio-2.4.6.0-r1 fails test - 50 - gif-broken (Failed)
Summary: media-libs/openimageio-2.4.6.0-r1 fails test - 50 - gif-broken (Failed)
Status: CONFIRMED
Alias: None
Product: Gentoo Linux
Classification: Unclassified
Component: Current packages (show other bugs)
Hardware: All Linux
: Normal normal (vote)
Assignee: Gentoo Science Related Packages
URL:
Whiteboard:
Keywords: TESTFAILURE
Depends on:
Blocks:
 
Reported: 2023-05-29 07:19 UTC by Toralf Förster
Modified: 2024-05-09 17:34 UTC (History)
1 user (show)

See Also:
Package list:
Runtime testing required: ---


Attachments
emerge-info.txt (emerge-info.txt,18.83 KB, text/plain)
2023-05-29 07:19 UTC, Toralf Förster
Details
LastTest.log.bz2 (LastTest.log.bz2,24.90 KB, application/x-bzip)
2023-05-29 07:19 UTC, Toralf Förster
Details
emerge-history.txt (emerge-history.txt,185.08 KB, text/plain)
2023-05-29 07:19 UTC, Toralf Förster
Details
environment (environment,139.02 KB, text/plain)
2023-05-29 07:19 UTC, Toralf Förster
Details
etc.clang.tar.bz2 (etc.clang.tar.bz2,732 bytes, application/x-bzip)
2023-05-29 07:19 UTC, Toralf Förster
Details
etc.portage.tar.bz2 (etc.portage.tar.bz2,25.71 KB, application/x-bzip)
2023-05-29 07:19 UTC, Toralf Förster
Details
logs.tar.bz2 (logs.tar.bz2,25.05 KB, application/x-bzip)
2023-05-29 07:19 UTC, Toralf Förster
Details
media-libs:openimageio-2.4.6.0-r1:20230529-032840.log (media-libs:openimageio-2.4.6.0-r1:20230529-032840.log,251.05 KB, text/plain)
2023-05-29 07:19 UTC, Toralf Förster
Details
temp.tar.bz2 (temp.tar.bz2,42.71 KB, application/x-bzip)
2023-05-29 07:19 UTC, Toralf Förster
Details
tests.tar.bz2 (tests.tar.bz2,25.92 KB, application/x-bzip)
2023-05-29 07:19 UTC, Toralf Förster
Details
build.log and emerge --info (file_907345.txt,574.08 KB, text/plain)
2024-04-26 15:49 UTC, matoro
Details

Note You need to log in before you can comment on or make changes to this bug.
Description Toralf Förster gentoo-dev 2023-05-29 07:19:08 UTC
98% tests passed, 2 tests failed out of 101

Total Test time (real) =  92.35 sec

The following tests FAILED:
	 50 - gif-broken (Failed)
	 88 - unit_timer (Failed)
Errors while running CTest

  -------------------------------------------------------------------

  This is an unstable amd64 chroot image at a tinderbox (==build bot)
  name: 17.1_no_multilib-j5_test-20230525-172553

  -------------------------------------------------------------------

gcc-config -l:
 [1] x86_64-pc-linux-gnu-10
 [2] x86_64-pc-linux-gnu-13 *
clang/llvm (if any):
clang version 16.0.4
Target: x86_64-pc-linux-gnu
Thread model: posix
InstalledDir: /usr/lib/llvm/16/bin
Configuration file: /etc/clang/clang.cfg
/usr/lib/llvm/16
16.0.4
Python 3.11.3
Available Rust versions:
  [1]   rust-1.69.0 *
The following VMs are available for generation-2:
1)	Eclipse Temurin JDK 11.0.18_p10 [openjdk-bin-11]
*)	Eclipse Temurin JDK 17.0.6_p10 [openjdk-bin-17]
3)	Eclipse Temurin JDK 8.362_p09 [openjdk-bin-8]
Available Java Virtual Machines:
  [1]   openjdk-bin-8 
  [2]   openjdk-bin-11 
  [3]   openjdk-bin-17  system-vm

php cli (if any):
  [1]   php8.2 *
go version go1.20.4 linux/amd64

  HEAD of ::gentoo
commit 5b2d1a93fe218b99cc2a5bfc44612d1bcde63a60
Author: Repository mirror & CI <repomirrorci@gentoo.org>
Date:   Mon May 29 01:01:56 2023 +0000

    Merge updates from master

emerge -qpvO media-libs/openimageio
[ebuild  N    ] media-libs/openimageio-2.4.6.0-r1  USE="raw test truetype -X -dicom -doc -ffmpeg -gif -jpeg2k -opencv -opengl -openvdb -ptex -python -qt5" CPU_FLAGS_X86="aes avx avx2 f16c sse2 sse3 sse4_1 sse4_2 ssse3 -avx512f" PYTHON_SINGLE_TARGET="python3_11 -python3_10"
Comment 1 Toralf Förster gentoo-dev 2023-05-29 07:19:10 UTC
Created attachment 862782 [details]
emerge-info.txt
Comment 2 Toralf Förster gentoo-dev 2023-05-29 07:19:11 UTC
Created attachment 862783 [details]
LastTest.log.bz2
Comment 3 Toralf Förster gentoo-dev 2023-05-29 07:19:12 UTC
Created attachment 862784 [details]
emerge-history.txt
Comment 4 Toralf Förster gentoo-dev 2023-05-29 07:19:13 UTC
Created attachment 862785 [details]
environment
Comment 5 Toralf Förster gentoo-dev 2023-05-29 07:19:14 UTC
Created attachment 862786 [details]
etc.clang.tar.bz2
Comment 6 Toralf Förster gentoo-dev 2023-05-29 07:19:15 UTC
Created attachment 862787 [details]
etc.portage.tar.bz2
Comment 7 Toralf Förster gentoo-dev 2023-05-29 07:19:16 UTC
Created attachment 862788 [details]
logs.tar.bz2
Comment 8 Toralf Förster gentoo-dev 2023-05-29 07:19:18 UTC
Created attachment 862789 [details]
media-libs:openimageio-2.4.6.0-r1:20230529-032840.log
Comment 9 Toralf Förster gentoo-dev 2023-05-29 07:19:19 UTC
Created attachment 862790 [details]
temp.tar.bz2
Comment 10 Toralf Förster gentoo-dev 2023-05-29 07:19:20 UTC
Created attachment 862791 [details]
tests.tar.bz2
Comment 11 matoro archtester 2024-04-26 15:48:29 UTC
One additional failure in 2.5.5.0.

97% tests passed, 3 tests failed out of 111

Total Test time (real) =  49.83 sec

The following tests FAILED:
          1 - docs-examples-cpp (Failed)
         58 - gif-broken (Failed)
        100 - unit_filter (Subprocess aborted)
Comment 12 matoro archtester 2024-04-26 15:49:15 UTC
Created attachment 891765 [details]
build.log and emerge --info