Gentoo Websites Logo
Go to: Gentoo Home Documentation Forums Lists Bugs Planet Store Wiki Get Gentoo!
Bug 905420 - www-client/chromium-112.0.5615.165 failed to rebuild with GCC 13
Summary: www-client/chromium-112.0.5615.165 failed to rebuild with GCC 13
Status: CONFIRMED
Alias: None
Product: Gentoo Linux
Classification: Unclassified
Component: Current packages (show other bugs)
Hardware: ARM64 Linux
: Normal normal (vote)
Assignee: Chromium Project
URL: https://github.com/llvm/llvm-project/...
Whiteboard:
Keywords: PATCH
Depends on:
Blocks: gcc-13
  Show dependency tree
 
Reported: 2023-05-01 13:54 UTC by Leonid Kopylov
Modified: 2023-05-04 22:18 UTC (History)
0 users

See Also:
Package list:
Runtime testing required: ---


Attachments
build.log.xz (build.log.xz,223.56 KB, application/xz)
2023-05-01 13:54 UTC, Leonid Kopylov
Details
Bulk of fixes (chrome3.patch,16.70 KB, patch)
2023-05-04 22:17 UTC, Mike Lothian
Details | Diff
Lines endings (temp.patch,359 bytes, patch)
2023-05-04 22:18 UTC, Mike Lothian
Details | Diff

Note You need to log in before you can comment on or make changes to this bug.
Description Leonid Kopylov 2023-05-01 13:54:35 UTC
# emerge -pqv '=www-client/chromium-112.0.5615.165::gentoo'
[ebuild   R   ] www-client/chromium-112.0.5615.165  USE="X cups gtk4 hangouts kerberos official (pic) proprietary-codecs pulseaudio qt5 screencast suid system-av1 system-harfbuzz system-icu system-png wayland (-component-build) -custom-cflags -debug (-headless) -libcxx -lto -pax-kernel (-pgo) (-selinux) (-system-ffmpeg) -vaapi (-widevine)" CPU_FLAGS_ARM="(-neon)" L10N="he ru -af -am -ar -bg -bn -ca -cs -da -de -el -en-GB -es -es-419 -et -fa -fi -fil -fr -gu -hi -hr -hu -id -it -ja -kn -ko -lt -lv -ml -mr -ms -nb -nl -pl -pt-BR -pt-PT -ro -sk -sl -sr -sv -sw -ta -te -th -tr -uk -ur -vi -zh-CN -zh-TW"

# emerge --info '=www-client/chromium-112.0.5615.165::gentoo'
Portage 3.0.47 (python 3.11.3-final-0, default/linux/arm64/17.0/desktop/gnome/systemd/merged-usr, gcc-13, glibc-2.37-r2, 6.3.0-gentoo-arm64 aarch64)
=================================================================
                         System Settings
=================================================================
System uname: Linux-6.3.0-gentoo-arm64-aarch64-with-glibc2.37
KiB Mem:    32817680 total,  18386496 free
KiB Swap:    8388604 total,   8388604 free
Timestamp of repository gentoo: Mon, 01 May 2023 05:30:02 +0000
Head commit of repository gentoo: 6dc9d4f835082cac9bc7d71dc13bb77014d5790c
sh bash 5.2_p15-r2
ld GNU ld (Gentoo 2.40 p4) 2.40.0
ccache version 4.8 [disabled]
app-misc/pax-utils:        1.3.7::gentoo
app-shells/bash:           5.2_p15-r2::gentoo
dev-java/java-config:      2.3.1::gentoo
dev-lang/perl:             5.36.1::gentoo
dev-lang/python:           3.10.11::gentoo, 3.11.3::gentoo, 3.12.0_alpha7::gentoo
dev-lang/rust:             1.69.0-r1::gentoo
dev-util/ccache:           4.8::gentoo
dev-util/cmake:            3.26.3::gentoo
dev-util/meson:            1.1.0::gentoo
sys-apps/baselayout:       2.13-r1::gentoo
sys-apps/sandbox:          2.30-r1::gentoo
sys-apps/systemd:          253.3-r1::gentoo
sys-devel/autoconf:        2.71-r6::gentoo
sys-devel/automake:        1.16.5-r1::gentoo
sys-devel/binutils:        2.40-r4::gentoo
sys-devel/binutils-config: 5.5::gentoo
sys-devel/clang:           16.0.2::gentoo
sys-devel/gcc:             12.2.1_p20230428-r1::gentoo, 13.1.0-r1::gentoo
sys-devel/gcc-config:      2.10::gentoo
sys-devel/libtool:         2.4.7-r1::gentoo
sys-devel/llvm:            14.0.6-r2::gentoo, 16.0.2::gentoo
sys-devel/make:            4.4.1::gentoo
sys-kernel/linux-headers:  6.3::gentoo (virtual/os-headers)
sys-libs/glibc:            2.37-r2::gentoo
Repositories:

gentoo
    location: /var/db/repos/gentoo
    sync-type: rsync
    sync-uri: rsync://server.kopylovs.net/gentoo-portage
    priority: -1000
    volatile: False
    sync-rsync-extra-opts:
    sync-rsync-verify-jobs: 1
    sync-rsync-verify-max-age: 24
    sync-rsync-verify-metamanifest: yes

ACCEPT_KEYWORDS="arm64 ~arm64"
ACCEPT_LICENSE="* -@EULA android AnyDesk-TOS geekbench Microsoft-vscode TeamViewer Vivaldi"
CBUILD="aarch64-unknown-linux-gnu"
CFLAGS="-O2 -pipe -fomit-frame-pointer"
CHOST="aarch64-unknown-linux-gnu"
CONFIG_PROTECT="/etc /usr/share/config /usr/share/gnupg/qualified.txt"
CONFIG_PROTECT_MASK="/etc/ca-certificates.conf /etc/dconf /etc/env.d /etc/fonts/fonts.conf /etc/gconf /etc/gentoo-release /etc/php/apache2-php8.2/ext-active/ /etc/php/cgi-php8.2/ext-active/ /etc/php/cli-php8.2/ext-active/ /etc/php/fpm-php8.2/ext-active/ /etc/php/phpdbg-php8.2/ext-active/ /etc/revdep-rebuild /etc/sandbox.d /etc/texmf/language.dat.d /etc/texmf/language.def.d /etc/texmf/updmap.d /etc/texmf/web2c"
CXXFLAGS="-O2 -pipe -fomit-frame-pointer"
DISTDIR="/var/cache/distfiles"
ENV_UNSET="CARGO_HOME DBUS_SESSION_BUS_ADDRESS DISPLAY GDK_PIXBUF_MODULE_FILE GOBIN GOPATH PERL5LIB PERL5OPT PERLPREFIX PERL_CORE PERL_MB_OPT PERL_MM_OPT XAUTHORITY XDG_CACHE_HOME XDG_CONFIG_HOME XDG_DATA_HOME XDG_RUNTIME_DIR XDG_STATE_HOME"
FCFLAGS="-O2 -pipe -fomit-frame-pointer"
FEATURES="assume-digests binpkg-docompress binpkg-dostrip binpkg-logs binpkg-multi-instance buildpkg-live config-protect-if-modified distlocks ebuild-locks fixlafiles ipc-sandbox merge-sync multilib-strict network-sandbox news parallel-fetch pid-sandbox preserve-libs protect-owned qa-unresolved-soname-deps sandbox sfperms strict strict-keepdir unknown-features-warn unmerge-logs unmerge-orphans userfetch userpriv usersandbox usersync warn-on-large-env xattr"
FFLAGS="-O2 -pipe -fomit-frame-pointer"
GENTOO_MIRRORS="https://mirror.isoc.org.il/pub/gentoo/"
LANG="en_US.utf8"
LC_ALL="en_US.UTF-8"
LDFLAGS="-Wl,-O1 -Wl,--as-needed"
LEX="flex"
MAKEOPTS="-j6"
PKGDIR="/var/cache/binpkgs"
PORTAGE_CONFIGROOT="/"
PORTAGE_RSYNC_OPTS="--recursive --links --safe-links --perms --times --omit-dir-times --compress --force --whole-file --delete --stats --human-readable --timeout=180 --exclude=/distfiles --exclude=/local --exclude=/packages --exclude=/.git"
PORTAGE_TMPDIR="/var/tmp"
SHELL="/bin/bash"
USE="X a52 aac aalib accessibility acl acpi activities alsa ao appindicator archive arm64 aspell audit bash-completion berkdb bidi bluetooth bluray boost branding brotli btrfs bzip2 cairo cdda cddb cdio cdr cgi cli colord contrib cron crypt cryptsetup cups curl dbi dbus designer device-mapper djvu doc dri dts dv dvb dvdr eds emacs enchant encode evdev evo examples executable exif expat experimental extra extras fam fastcgi fbcon ffmpeg fftw flac fluidsynth fontconfig fontforge fortran freetds ftp fuse gamepad games gcrypt gd gdbm gdk-pixbuf geoip geolocation gif git glade glib glusterfs gme gmp gnome gnome-keyring gnome-online-accounts gnuplot gnutls go gpg gphoto2 gpm graphite graphviz gsm gssapi gstreamer gtk gtk-doc gtk3 gui guile harfbuzz hdf5 heif highlight hscolour html http http2 ibus iconv icu idn imagemagick imap imlib introspection iodbc ipv6 jack java javascript jbig jemalloc joystick jpeg jpeg2k jpegxl json kde kerberos ladspa lame latex lcms ldap libass libcaca libevent libglvnd libnotify libsamplerate libsecret libtirpc libxml2 lmdb lua lv2 lvm lz4 lzma lzo mad magic maildir man mbedtls mbox memcached midi mmap mng modplug mp3 mp4 mpeg mplayer mtp multimedia musepack mysql nas nautilus ncurses netlink nettle network networkmanager nfs nls nptl nss ntlm odbc offensive ogg openal openexr opengl openmp openssl opus pam pango pcap pcre pdf perl phonon pkcs11 plasma plugins png policykit portaudio postgres postscript ppds pulseaudio python qdbm qml qrcode qt5 raw rdma readline redis rss samba sasl screencast sctp sdl seccomp semantic-desktop sftp share skey smp smtp snappy sndfile sndio snmp sound source sox speech speex spell sql sqlite ssh ssl startup-notification svg symlink syslog systemd taglib tbb tcl tcpd telemetry telepathy test-rust theora threads tiff tk tools tracker tremor truetype twolame udev udisks unicode unwind upnp upower usb utils uuid v4l vala vcd vim-syntax vnc vorbis vpx wavpack wayland webengine webkit webp websockets widgets wmf wxwidgets x264 x265 xattr xcb xface xft xinerama xml xmp xpm xscreensaver xv xvid yaml zeroconf zip zlib zsh-completion zstd" ADA_TARGET="gnat_2021" APACHE2_MODULES="authn_core authz_core socache_shmcb unixd actions alias auth_basic authn_alias authn_anon authn_dbm authn_default authn_file authz_dbm authz_default authz_groupfile authz_host authz_owner authz_user autoindex cache cgi cgid dav dav_fs dav_lock deflate dir disk_cache env expires ext_filter file_cache filter headers include info log_config logio mem_cache mime mime_magic negotiation rewrite setenvif speling status unique_id userdir usertrack vhost_alias" CALLIGRA_FEATURES="karbon sheets words stage" COLLECTD_PLUGINS="df interface irq load memory rrdtool swap syslog" CPU_FLAGS_ARM="edsp thumb vfp vfpv3 vfpv4 vfp-d32 aes sha1 sha2 crc32 v4 v5 v6 v7 v8 thumb2" ELIBC="glibc" GPSD_PROTOCOLS="ashtech aivdm earthmate evermore fv18 garmin garmintxt gpsclock greis isync itrax mtk3301 nmea ntrip navcom oceanserver oldstyle oncore rtcm104v2 rtcm104v3 sirf skytraq superstar2 timing tsip tripmate tnt ublox ubx" GRUB_PLATFORMS="efi-64" INPUT_DEVICES="evdev joystick libinput" KERNEL="linux" L10N="en en-US he ru" LCD_DEVICES="bayrad cfontz cfontz633 glk hd44780 lb216 lcdm001 mtxorb ncurses text" LIBREOFFICE_EXTENSIONS="nlpsolver" LUA_SINGLE_TARGET="lua5-1" LUA_TARGETS="lua5-1" OFFICE_IMPLEMENTATION="libreoffice" PHP_TARGETS="php7-4 php8-0" POSTGRES_TARGETS="postgres12 postgres13" PYTHON_SINGLE_TARGET="python3_11" PYTHON_TARGETS="python3_10 python3_11" RUBY_TARGETS="ruby30 ruby31 ruby32" USERLAND="GNU" VIDEO_CARDS="virgl" XTABLES_ADDONS="quota2 psd pknock lscan length2 ipv4options ipset ipp2p iface geoip fuzzy condition tee tarpit sysrq proto steal rawnat logmark ipmark dhcpmac delude chaos account"
Unset:  ADDR2LINE, AR, ARFLAGS, AS, ASFLAGS, CC, CCLD, CONFIG_SHELL, CPP, CPPFLAGS, CTARGET, CXX, CXXFILT, ELFEDIT, EMERGE_DEFAULT_OPTS, EXTRA_ECONF, F77FLAGS, FC, GCOV, GPROF, INSTALL_MASK, LD, LFLAGS, LIBTOOL, LINGUAS, MAKE, MAKEFLAGS, NM, OBJCOPY, OBJDUMP, PORTAGE_BINHOST, PORTAGE_BUNZIP2_COMMAND, PORTAGE_COMPRESS, PORTAGE_COMPRESS_FLAGS, PORTAGE_RSYNC_EXTRA_OPTS, RANLIB, READELF, RUSTFLAGS, SIZE, STRINGS, STRIP, YACC, YFLAGS

=================================================================
                        Package Settings
=================================================================

www-client/chromium-112.0.5615.165::gentoo was built with the following:
USE="X cups gtk4 hangouts kerberos official (pic) proprietary-codecs pulseaudio qt5 screencast suid system-av1 system-harfbuzz system-icu system-png wayland (-component-build) -custom-cflags -debug (-headless) -libcxx -lto -pax-kernel (-pgo) (-selinux) (-system-ffmpeg) -vaapi (-widevine)" CPU_FLAGS_ARM="(-neon)" L10N="he ru -af -am -ar -bg -bn -ca -cs -da -de -el -en-GB -es -es-419 -et -fa -fi -fil -fr -gu -hi -hr -hu -id -it -ja -kn -ko -lt -lv -ml -mr -ms -nb -nl -pl -pt-BR -pt-PT -ro -sk -sl -sr -sv -sw -ta -te -th -tr -uk -ur -vi -zh-CN -zh-TW"
CFLAGS="-O2 -pipe"
CXXFLAGS="-O2 -pipe -fno-tree-vectorize"
Comment 1 Leonid Kopylov 2023-05-01 13:54:52 UTC
Created attachment 861018 [details]
build.log.xz
Comment 2 Sam James archtester Gentoo Infrastructure gentoo-dev Security 2023-05-01 13:57:23 UTC
FAILED: [0mobj/third_party/swiftshader/third_party/llvm-10.0/swiftshader_llvm_support/Signals.o 
aarch64-unknown-linux-gnu-g++ -MMD -MF obj/third_party/swiftshader/third_party/llvm-10.0/swiftshader_llvm_support/Signals.o.d -DUSE_UDEV -DUSE_AURA=1 -DUSE_GLIB=1 -DUSE_OZONE=1 -DOFFICIAL_BUILD -D_FILE_OFFSET_BITS=64 -D_LARGEFILE_SOURCE -D_LARGEFILE64_SOURCE -DNO_UNWIND_TABLES -DNDEBUG -DNVALGRIND -DDYNAMIC_ANNOTATIONS_ENABLED=0 -D__STDC_CONSTANT_MACROS -D__STDC_LIMIT_MACROS -I../../third_party/swiftshader/third_party/llvm-10.0/llvm/include -I../../third_party/swiftshader/third_party/llvm-10.0/llvm/lib/Target/AArch64 -I../../third_party/swiftshader/third_party/llvm-10.0/llvm/lib/Target/ARM -I../../third_party/swiftshader/third_party/llvm-10.0/llvm/lib/Target/Mips -I../../third_party/swiftshader/third_party/llvm-10.0/llvm/lib/Target/PowerPC -I../../third_party/swiftshader/third_party/llvm-10.0/llvm/lib/Target/RISCV -I../../third_party/swiftshader/third_party/llvm-10.0/llvm/lib/Target/X86 -I../../third_party/swiftshader/third_party/llvm-10.0/configs/common/include -I../../third_party/swiftshader/third_party/llvm-10.0/configs/common/lib/IR -I../../third_party/swiftshader/third_party/llvm-10.0/configs/common/lib/Target/AArch64 -I../../third_party/swiftshader/third_party/llvm-10.0/configs/common/lib/Target/ARM -I../../third_party/swiftshader/third_party/llvm-10.0/configs/common/lib/Target/Mips -I../../third_party/swiftshader/third_party/llvm-10.0/configs/common/lib/Target/PowerPC -I../../third_party/swiftshader/third_party/llvm-10.0/configs/common/lib/Target/RISCV -I../../third_party/swiftshader/third_party/llvm-10.0/configs/common/lib/Target/X86 -I../../third_party/swiftshader/third_party/llvm-10.0/configs/common/lib/Transforms/InstCombine -I../../third_party/swiftshader/third_party/llvm-10.0/configs/linux/include -I../.. -Igen -fno-ident -fno-strict-aliasing --param=ssp-buffer-size=4 -fstack-protector -fno-unwind-tables -fno-asynchronous-unwind-tables -fPIC -pipe -pthread -fno-omit-frame-pointer -fvisibility=hidden -Wno-unused-local-typedefs -Wno-maybe-uninitialized -Wno-deprecated-declarations -Wno-comments -Wno-packed-not-aligned -Wno-missing-field-initializers -Wno-unused-parameter -Wno-psabi -Os -std=gnu++2a -fno-exceptions -fno-rtti -fvisibility-inlines-hidden -Wno-narrowing -Wno-class-memaccess -O2 -pipe -fno-tree-vectorize -c ../../third_party/swiftshader/third_party/llvm-10.0/llvm/lib/Support/Signals.cpp -o obj/third_party/swiftshader/third_party/llvm-10.0/swiftshader_llvm_support/Signals.o
In file included from ../../third_party/swiftshader/third_party/llvm-10.0/llvm/lib/Support/Signals.cpp:14:
../../third_party/swiftshader/third_party/llvm-10.0/llvm/include/llvm/Support/Signals.h:117:8: error: variable or field ‘CleanupOnSignal’ declared void
  117 |   void CleanupOnSignal(uintptr_t Context);
      |        ^~~~~~~~~~~~~~~
../../third_party/swiftshader/third_party/llvm-10.0/llvm/include/llvm/Support/Signals.h:117:24: error: ‘uintptr_t’ was not declared in this scope
  117 |   void CleanupOnSignal(uintptr_t Context);
      |                        ^~~~~~~~~
../../third_party/swiftshader/third_party/llvm-10.0/llvm/include/llvm/Support/Signals.h:18:1: note: ‘uintptr_t’ is defined in header ‘<cstdint>’; did you forget to ‘#include <cstdint>’?
   17 | #include <string>
  +++ |+#include <cstdint>
   18 | 
In file included from ../../third_party/swiftshader/third_party/llvm-10.0/llvm/lib/Support/Signals.cpp:220:
../../third_party/swiftshader/third_party/llvm-10.0/llvm/lib/Support/Unix/Signals.inc:346:44: error: ‘void llvm::sys::CleanupOnSignal(uintptr_t)’ should have been declared inside ‘llvm::sys’
  346 | void sys::CleanupOnSignal(uintptr_t Context) {
      |                                            ^
Comment 3 Stephan Hartmann (RETIRED) gentoo-dev 2023-05-01 14:31:11 UTC
Needs to be committed to SwiftShader repo (they maintain their own llvm tree).
Comment 4 Mike Lothian 2023-05-04 22:17:24 UTC
Created attachment 861146 [details, diff]
Bulk of fixes

These are most of the changes I needed to get things compiling for me with clang and libstdc++ 13
Comment 5 Mike Lothian 2023-05-04 22:18:51 UTC
Created attachment 861147 [details, diff]
Lines endings

When this one was included as part of the previous patch, portage refused to apply it due to differing line endings

I've split it out and it appears to apply now