Gentoo Websites Logo
Go to: Gentoo Home Documentation Forums Lists Bugs Planet Store Wiki Get Gentoo!
Bug 775617 - sys-cluster/slurm-20.11.0.1-r100 /bin/dash: 1: pushd: not found/bin/dash: 1: when using SHELL=/bin/dash and CONFIG_SHELL=/bin/dash
Summary: sys-cluster/slurm-20.11.0.1-r100 /bin/dash: 1: pushd: not found/bin/dash: 1: ...
Status: UNCONFIRMED
Alias: None
Product: Gentoo Linux
Classification: Unclassified
Component: Current packages (show other bugs)
Hardware: All Linux
: Normal normal (vote)
Assignee: Alexey Shvetsov
URL:
Whiteboard:
Keywords:
Depends on:
Blocks: nonbash
  Show dependency tree
 
Reported: 2021-03-12 10:42 UTC by Alessandro Barbieri
Modified: 2021-04-03 21:09 UTC (History)
3 users (show)

See Also:
Package list:
Runtime testing required: ---


Attachments
slurm-20.11.0.1-r100:20210312-103212.log (slurm-20.11.0.1-r100:20210312-103212.log,672.11 KB, text/plain)
2021-03-12 10:43 UTC, Alessandro Barbieri
Details

Note You need to log in before you can comment on or make changes to this bug.
Description Alessandro Barbieri 2021-03-12 10:42:19 UTC
Making all in scrontab                                                                                                                                                                                             
make[3]: Entering directory '/var/tmp/portage/sys-cluster/slurm-20.11.0.1-r100/work/slurm-slurm-20-11-0-1/src/scrontab'                                                                                            
x86_64-pc-linux-gnu-gcc -DHAVE_CONFIG_H -I. -I../.. -I../../slurm  -I../..   -DNUMA_VERSION1_COMPATIBILITY -Os -pipe -march=native -Os -pipe -march=native -Wimplicit-function-declaration -Wno-error=implicit-func
tion-declaration -fno-omit-frame-pointer -pthread -c -o opt.o opt.c                                      
x86_64-pc-linux-gnu-gcc -DHAVE_CONFIG_H -I. -I../.. -I../../slurm  -I../..   -DNUMA_VERSION1_COMPATIBILITY -Os -pipe -march=native -Os -pipe -march=native -Wimplicit-function-declaration -Wno-error=implicit-func
tion-declaration -fno-omit-frame-pointer -pthread -c -o parse.o parse.c                                  
x86_64-pc-linux-gnu-gcc -DHAVE_CONFIG_H -I. -I../.. -I../../slurm  -I../..   -DNUMA_VERSION1_COMPATIBILITY -Os -pipe -march=native -Os -pipe -march=native -Wimplicit-function-declaration -Wno-error=implicit-func
tion-declaration -fno-omit-frame-pointer -pthread -c -o scrontab.o scrontab.c     
pushd /var/tmp/portage/sys-cluster/slurm-20.11.0.1-r100/work/slurm-slurm-20-11-0-1/src/scrontab; /usr/bin/ld.lld -m elf_x86_64 -r -o "/var/tmp/portage/sys-cluster/slurm-20.11.0.1-r100/work/slurm-slurm-20-11-0-1/
src/scrontab/default_crontab.bino" -z noexecstack --format=binary "default_crontab.txt"; popd                                                                                                                      
pushd /var/tmp/portage/sys-cluster/slurm-20.11.0.1-r100/work/slurm-slurm-20-11-0-1/src/scrontab; /usr/bin/ld.lld -m elf_x86_64 -r -o "/var/tmp/portage/sys-cluster/slurm-20.11.0.1-r100/work/slurm-slurm-20-11-0-1/
src/scrontab/usage.bino" -z noexecstack --format=binary "usage.txt"; popd
/bin/dash: 1: pushd: not found/bin/dash: 1: 
pushd: not found
/bin/dash: 1: popd: not found
make[3]: *** [Makefile:833: default_crontab.bino] Error 127
make[3]: *** Waiting for unfinished jobs....
/bin/dash: 1: popd: not found
make[3]: *** [Makefile:833: usage.bino] Error 127
make[3]: Leaving directory '/var/tmp/portage/sys-cluster/slurm-20.11.0.1-r100/work/slurm-slurm-20-11-0-1/src/scrontab'
make[2]: *** [Makefile:530: all-recursive] Error 1
make[2]: Leaving directory '/var/tmp/portage/sys-cluster/slurm-20.11.0.1-r100/work/slurm-slurm-20-11-0-1/src'
make[1]: *** [Makefile:610: all-recursive] Error 1
make[1]: Leaving directory '/var/tmp/portage/sys-cluster/slurm-20.11.0.1-r100/work/slurm-slurm-20-11-0-1' 
make: *** [Makefile:509: all] Error 2
 * ERROR: sys-cluster/slurm-20.11.0.1-r100::gentoo failed (compile phase):
 *   emake failed
Comment 1 Alessandro Barbieri 2021-03-12 10:43:07 UTC
Created attachment 690972 [details]
slurm-20.11.0.1-r100:20210312-103212.log

buildlog