Gentoo Websites Logo
Go to: Gentoo Home Documentation Forums Lists Bugs Planet Store Wiki Get Gentoo!
Bug 738826 - app-arch/tar-1.32 fails tests
Summary: app-arch/tar-1.32 fails tests
Status: UNCONFIRMED
Alias: None
Product: Gentoo Linux
Classification: Unclassified
Component: Current packages (show other bugs)
Hardware: All Linux
: Normal normal (vote)
Assignee: Gentoo's Team for Core System packages
URL:
Whiteboard:
Keywords: TESTFAILURE
Depends on:
Blocks:
 
Reported: 2020-08-24 14:34 UTC by Paolo Pedroni
Modified: 2020-08-25 10:04 UTC (History)
1 user (show)

See Also:
Package list:
Runtime testing required: ---


Attachments
tar-1.32:20200824-124805.log.gz (tar-1.32:20200824-124805.log.gz,32.90 KB, application/gzip)
2020-08-24 14:34 UTC, Paolo Pedroni
Details
testsuite.log (testsuite.log,824.65 KB, text/x-log)
2020-08-24 14:35 UTC, Paolo Pedroni
Details

Note You need to log in before you can comment on or make changes to this bug.
Description Paolo Pedroni 2020-08-24 14:34:45 UTC
Created attachment 656440 [details]
tar-1.32:20200824-124805.log.gz

[...]
 11: --pax-option compatibility                      FAILED (opcomp06.at:24)
[...]
211: xattrs: basic functionality                     FAILED (xattr01.at:28)
212: xattrs: change directory with -C option         FAILED (xattr02.at:28)
213: xattrs: trusted.* attributes                    skipped (xattr03.at:28)
214: xattrs: s/open/openat/ regression               FAILED (xattr04.at:29)
215: xattrs: keywords with '=' and '%'               FAILED (xattr05.at:31)
216: xattrs: exclude xattrs on create                skipped (xattr06.at:30)
217: xattrs: xattrs and --skip-old-files             FAILED (xattr07.at:29)
218: acls: basic functionality                       FAILED (acls01.at:28)
219: acls: work with -C                              FAILED (acls02.at:28)
220: acls: default ACLs                              FAILED (acls03.at:47)
[...]
## ------------- ##
## Test results. ##
## ------------- ##

ERROR: 218 tests were run,
9 failed unexpectedly.
16 tests were skipped.
## -------------------------- ##
## testsuite.log was created. ##
## -------------------------- ##

Please send `tests/testsuite.log' and all information you think might help:

   To: <bug-tar@gnu.org>
   Subject: [GNU tar 1.32] testsuite: 11 211 212 214 215 217 218 219 220 failed

You may investigate any problem if you feel able to do so, in which
case the test suite provides a good starting point.  Its output may
be found below `tests/testsuite.dir'.

make[2]: *** [Makefile:1838: check-local] Error 1
make[2]: Leaving directory '/var/tmp/portage/app-arch/tar-1.32/work/tar-1.32/tests'
make[1]: *** [Makefile:1690: check-am] Error 2
make[1]: Leaving directory '/var/tmp/portage/app-arch/tar-1.32/work/tar-1.32/tests'
make: *** [Makefile:1410: check-recursive] Error 1

# emerge --info =app-arch/tar-1.32
Portage 2.3.103 (python 3.7.8-final-0, default/linux/amd64/17.1/desktop/plasma/systemd, gcc-9.3.0, glibc-2.31-r6, 5.7.16-gentoo x86_64)
=================================================================
                         System Settings
=================================================================
System uname: Linux-5.7.16-gentoo-x86_64-Intel-R-_Core-TM-_i5-8400_CPU_@_2.80GHz-with-gentoo-2.6
KiB Mem:    16123188 total,    361084 free
KiB Swap:   16777212 total,  16665852 free
Timestamp of repository gentoo: Wed, 19 Aug 2020 14:00:01 +0000
Head commit of repository gentoo: c87110aac367a9d3725fbd234e086bb53b2c5d66
sh dash 0.5.11.1
ld GNU gold (Gentoo 2.33.1 p2 2.33.1) 1.16
ccache version 3.7.10 [disabled]
app-shells/bash:          5.0_p17::gentoo
dev-java/java-config:     2.3.1::gentoo
dev-lang/perl:            5.30.3::gentoo
dev-lang/python:          2.7.18-r1::gentoo, 3.7.8-r2::gentoo, 3.8.5::gentoo
dev-util/ccache:          3.7.10::gentoo
dev-util/cmake:           3.16.5::gentoo
sys-apps/baselayout:      2.6-r1::gentoo
sys-apps/sandbox:         2.18::gentoo
sys-devel/autoconf:       2.13-r1::gentoo, 2.69-r4::gentoo
sys-devel/automake:       1.16.1-r1::gentoo
sys-devel/binutils:       2.33.1-r1::gentoo
sys-devel/gcc:            9.3.0-r1::gentoo
sys-devel/gcc-config:     2.3.1::gentoo
sys-devel/libtool:        2.4.6-r6::gentoo
sys-devel/make:           4.2.1-r4::gentoo
sys-kernel/linux-headers: 5.4-r1::gentoo (virtual/os-headers)
sys-libs/glibc:           2.31-r6::gentoo
Repositories:

gentoo
    location: /usr/portage
    sync-type: rsync
    sync-uri: rsync://rsync.gentoo.org/gentoo-portage
    priority: -1000
    sync-rsync-extra-opts: 
    sync-rsync-verify-metamanifest: yes
    sync-rsync-verify-jobs: 1
    sync-rsync-verify-max-age: 24

x-portage
    location: /usr/local/portage
    masters: gentoo
    priority: 0

ACCEPT_KEYWORDS="amd64"
ACCEPT_LICENSE="* -@EULA"
CBUILD="x86_64-pc-linux-gnu"
CFLAGS="-O2 -pipe -frecord-gcc-switches -march=skylake -mabm -flto=6"
CHOST="x86_64-pc-linux-gnu"
CONFIG_PROTECT="/etc /usr/lib64/libreoffice/program/sofficerc /usr/share/config /usr/share/gnupg/qualified.txt"
CONFIG_PROTECT_MASK="/etc/ca-certificates.conf /etc/dconf /etc/env.d /etc/fonts/fonts.conf /etc/gconf /etc/gentoo-release /etc/revdep-rebuild /etc/sandbox.d /etc/terminfo"
CXXFLAGS="-O2 -pipe -frecord-gcc-switches -march=skylake -mabm -flto=6"
DISTDIR="/usr/portage/distfiles"
EMERGE_DEFAULT_OPTS="--keep-going y --with-bdeps y"
ENV_UNSET="DBUS_SESSION_BUS_ADDRESS DISPLAY GOBIN GOPATH PERL5LIB PERL5OPT PERLPREFIX PERL_CORE PERL_MB_OPT PERL_MM_OPT XAUTHORITY XDG_CACHE_HOME XDG_CONFIG_HOME XDG_DATA_HOME XDG_RUNTIME_DIR"
FCFLAGS="-O2 -pipe -frecord-gcc-switches -march=skylake -mabm -flto=6"
FEATURES="assume-digests binpkg-docompress binpkg-dostrip binpkg-logs cgroup compress-build-logs config-protect-if-modified distlocks ebuild-locks ipc-sandbox merge-sync multilib-strict network-sandbox news parallel-fetch pid-sandbox preserve-libs protect-owned qa-unresolved-soname-deps sandbox sfperms sign split-elog split-log strict strict-keepdir test unknown-features-warn unmerge-logs unmerge-orphans userfetch userpriv usersandbox usersync xattr"
FFLAGS="-O2 -pipe -frecord-gcc-switches -march=skylake -mabm -flto=6"
GENTOO_MIRRORS="http://mirrors.evowise.com/gentoo/ https://mirrors.evowise.com/gentoo/ http://mirror.eu.oneandone.net/linux/distributions/gentoo/gentoo/ http://mirror.netcologne.de/gentoo/"
LANG="it_IT.utf8"
LDFLAGS="-Wl,-O1 -Wl,--as-needed -Wl,--hash-style=gnu -Wl,--sort-common -flto=6"
LINGUAS="it it_IT"
MAKEOPTS="-j7 -l6"
PKGDIR="/var/cache/binpkgs"
PORTAGE_CONFIGROOT="/"
PORTAGE_RSYNC_OPTS="--recursive --links --safe-links --perms --times --omit-dir-times --compress --force --whole-file --delete --stats --human-readable --timeout=180 --exclude=/distfiles --exclude=/local --exclude=/packages --exclude=/.git"
PORTAGE_TMPDIR="/var/tmp"
USE="X a52 aac aalib acl acpi activities adns alsa amd64 ao audiofile bash-completion bluetooth branding brotli bzip2 cairo caps cdda cddb cdparanoia cdr cli crypt css cups curl dbus declarative dga djvu dri dts dvd dvdr emboss encode exif expat fbcon ffmpeg fftw flac fontconfig foomaticdb fortran ftp gd gdbm geoip gif gimp gmp gnutls gphoto2 gpm graphviz gtk handbook iconv icu idn imagemagick imlib introspection ipv6 java javascript jbig jemalloc jpeg jpeg2k kde kipi kwallet lame lcms libass libglvnd libnotify libsamplerate libtirpc lm_sensors lua lzma lzo mad mmap mng mp3 mp4 mpeg mplayer multilib musicbrainz ncurses nls nptl nsplugin offensive ogg openal opengl openmp pam pango pcre pdf phonon plasma png policykit postscript ppds pulseaudio qml qt5 rdesktop readline recode samba sctp sdl seccomp sndfile sockets speex spell split-usr sqlite ssl startup-notification svg symlink syslog systemd sysvipc taglib telemetry test theora threads tidy tiff truetype udev udisks unicode upower usb vaapi vala vim-syntax vnc vorbis wavpack wayland widgets win32codecs wmf wxwidgets x264 xattr xcb xine xml xpm xscreensaver xv xvid yahoo zlib zstd" ABI_X86="64" ADA_TARGET="gnat_2018" ALSA_CARDS="hda-intel virmidi" APACHE2_MODULES="authn_core authz_core socache_shmcb unixd actions alias auth_basic authn_alias authn_anon authn_dbm authn_default authn_file authz_dbm authz_default authz_groupfile authz_host authz_owner authz_user autoindex cache cgi cgid dav dav_fs dav_lock deflate dir disk_cache env expires ext_filter file_cache filter headers include info log_config logio mem_cache mime mime_magic negotiation rewrite setenvif speling status unique_id userdir usertrack vhost_alias" CALLIGRA_FEATURES="karbon sheets words" CAMERAS="kodak ptp2" COLLECTD_PLUGINS="df interface irq load memory rrdtool swap syslog" CPU_FLAGS_X86="aes avx avx2 f16c fma3 mmx mmxext pclmul popcnt rdrand sse sse2 sse3 sse4_1 sse4_2 ssse3" CURL_SSL="gnutls" ELIBC="glibc" GPSD_PROTOCOLS="ashtech aivdm earthmate evermore fv18 garmin garmintxt gpsclock greis isync itrax mtk3301 nmea ntrip navcom oceanserver oldstyle oncore rtcm104v2 rtcm104v3 sirf skytraq superstar2 timing tsip tripmate tnt ublox ubx" INPUT_DEVICES="libinput" KERNEL="linux" L10N="it en" LCD_DEVICES="bayrad cfontz cfontz633 glk hd44780 lb216 lcdm001 mtxorb ncurses text" LIBREOFFICE_EXTENSIONS="nlpsolver wiki-publisher" OFFICE_IMPLEMENTATION="libreoffice" PHP_TARGETS="php7-2 php7-3" POSTGRES_TARGETS="postgres10 postgres11" PYTHON_SINGLE_TARGET="python3_7" PYTHON_TARGETS="python3_7" RUBY_TARGETS="ruby25" USERLAND="GNU" VIDEO_CARDS="intel i965" XTABLES_ADDONS="quota2 psd pknock lscan length2 ipv4options ipset ipp2p iface geoip fuzzy condition tee tarpit sysrq steal rawnat logmark ipmark dhcpmac delude chaos account"
Unset:  CC, CPPFLAGS, CTARGET, CXX, INSTALL_MASK, LC_ALL, PORTAGE_BINHOST, PORTAGE_BUNZIP2_COMMAND, PORTAGE_COMPRESS, PORTAGE_COMPRESS_FLAGS, PORTAGE_RSYNC_EXTRA_OPTS

=================================================================
                        Package Settings
=================================================================

app-arch/tar-1.32::gentoo was built with the following:
USE="acl nls xattr -minimal (-selinux) -static" ABI_X86="(64)"

# emerge -1pqv =app-arch/tar-1.32
[ebuild   R   ] app-arch/tar-1.32  USE="acl nls xattr -minimal (-selinux) -static"
Comment 1 Paolo Pedroni 2020-08-24 14:35:15 UTC
Created attachment 656442 [details]
testsuite.log
Comment 2 Thomas Deutschmann gentoo-dev 2020-08-24 15:45:16 UTC
Are you running tests on a filesystem with xattrs support?
Comment 3 Paolo Pedroni 2020-08-25 10:04:45 UTC
(In reply to Thomas Deutschmann from comment #2)
> Are you running tests on a filesystem with xattrs support?

I guess so:
$ grep XATTR /usr/src/linux/.config
CONFIG_REISERFS_FS_XATTR=y
CONFIG_F2FS_FS_XATTR=y
CONFIG_TMPFS_XATTR=y             <---------------------------
CONFIG_SQUASHFS_XATTR=y
CONFIG_EROFS_FS_XATTR=y
CONFIG_CIFS_XATTR=y

$ mount | grep /var/tmp/portage
none on /var/tmp/portage type tmpfs (rw,nosuid,nodev,relatime,size=8867756k,mode=775,uid=250,gid=250)

$ genlop -t tar
 * app-arch/tar

     Mon Apr 27 14:44:15 2020 >>> app-arch/tar-1.32
       merge time: 3 minutes and 30 seconds.

     Mon Aug 24 16:37:33 2020 >>> app-arch/tar-1.32
       merge time: 1 minute and 10 seconds.

Last time I emerged app-arch/tar, in April, those tests where somehow skipped:
$ zgrep -A 15 Extended\ attributes /var/log/portage/build/app-arch/tar-1.32\:20200427-124044.log.gz 
Extended attributes

211: xattrs: basic functionality                     skipped (xattr01.at:28)
212: xattrs: change directory with -C option         skipped (xattr02.at:28)
213: xattrs: trusted.* attributes                    skipped (xattr03.at:28)
214: xattrs: s/open/openat/ regression               skipped (xattr04.at:29)
215: xattrs: keywords with '=' and '%'               skipped (xattr05.at:31)
216: xattrs: exclude xattrs on create                skipped (xattr06.at:30)
217: xattrs: xattrs and --skip-old-files             skipped (xattr07.at:29)
218: acls: basic functionality                       skipped (acls01.at:28)
219: acls: work with -C                              skipped (acls02.at:28)
220: acls: default ACLs                              skipped (acls03.at:47)
221: selinux: basic store/restore                    skipped (selnx01.at:28)
222: acls/selinux: special files & fifos             skipped (selacl01.at:28)
223: capabilities: binary store/restore              skipped (capabs_raw01.at:28)