Gentoo Websites Logo
Go to: Gentoo Home Documentation Forums Lists Bugs Planet Store Wiki Get Gentoo!
Bug 688044 - app-editors/vim-8.1.1486 fails test_lua.vim test
Summary: app-editors/vim-8.1.1486 fails test_lua.vim test
Status: UNCONFIRMED
Alias: None
Product: Gentoo Linux
Classification: Unclassified
Component: Current packages (show other bugs)
Hardware: All Linux
: Normal normal (vote)
Assignee: Vim Maintainers
URL:
Whiteboard:
Keywords: TESTFAILURE
Depends on:
Blocks:
 
Reported: 2019-06-14 10:25 UTC by Paolo Pedroni
Modified: 2019-06-15 20:29 UTC (History)
1 user (show)

See Also:
Package list:
Runtime testing required: ---


Attachments
vim-8.1.1486:20190614-093020.log.gz (vim-8.1.1486:20190614-093020.log.gz,48.48 KB, application/gzip)
2019-06-14 10:25 UTC, Paolo Pedroni
Details

Note You need to log in before you can comment on or make changes to this bug.
Description Paolo Pedroni 2019-06-14 10:25:25 UTC
Created attachment 579772 [details]
vim-8.1.1486:20190614-093020.log.gz

Test results:

Skipped:
        test_balloon.vim: cannot make screendumps
        Test_client_server(): $DISPLAY is not set
        test_conceal.vim: cannot make screendumps
        Test_Debugger(): cannot run Vim in a terminal window
        Test_diff_of_diff(): cannot run Vim in a terminal window
        Test_diff_screen(): cannot make screendumps and/or menu feature missing
        Test_diff_with_cursorline(): cannot run Vim in a terminal window
        Test_folds_with_rnu(): cannot make screendumps
        Test_cursorline_after_yank(): cannot make screendumps
        Test_cursorline_with_visualmode(): cannot make screendumps
        Test_wincolor(): cannot make screendumps
        Test_normal30_changecase(): Turkish locale not available
        Test_normal35_g_cmd4(): output of g< can't be tested currently
        Test_normal47_autocmd(): not possible to test cursorhold autocmd while waiting for input in normal_cmd
        Test_popup_all_corners(): cannot make screendumps
        Test_popup_never_behind(): cannot make screendumps
        Test_popup_with_border_and_padding(): cannot make screendumps
        Test_popup_with_syntax_setbufvar(): cannot make screendumps
        Test_popup_with_syntax_win_execute(): cannot make screendumps
        Test_popup_with_wrap(): cannot make screendumps
        Test_popup_without_wrap(): cannot make screendumps
        Test_simple_popup(): cannot make screendumps
        Test_restricted_mzscheme(): MzScheme is not supported
        Test_restricted_perl(): Perl is not supported
        Test_restricted_python(): Python is not supported
        Test_restricted_python3(): Python3 is not supported
        Test_restricted_ruby(): Ruby is not supported
        Test_restricted_tcl(): Tcl is not supported
        Test_incsearch_scrolling(): cannot make screendumps
        Test_incsearch_search_dump(): cannot make screendumps
        Test_incsearch_sort_dump(): cannot make screendumps
        Test_incsearch_substitute_dump(): cannot make screendumps
        Test_incsearch_vimgrep_dump(): cannot make screendumps
        Test_incsearch_with_change(): cannot make screendumps and/or timers feature and/or incsearch option missing
        Test_start_with_tabs(): cannot make screendumps
        Test_swap_group(): need at least two groups, got ['portage']
        Test_syntax_c(): cannot make screendumps
        Test_term_mouse_middle_click(): No working clipboard
        test_termencoding.vim: cannot make screendumps
        Test_textprop_screenshot_various(): cannot make screendumps or not using utf-8
        Test_textprop_screenshot_visual(): cannot make screendumps
        Test_detect_ambiwidth(): cannot run Vim in a terminal window
        Test_popup_and_previewwindow_dump(): cannot make screendumps
        Test_popup_command(): cannot make screendumps and/or menu feature missing
        Test_popup_position(): cannot make screendumps
        Test_restore_count(): cannot run Vim in a terminal window
        Test_tabpage_cmdheight(): cannot make screendumps

-------------------------------
Executed:  1889 Tests
 Skipped:    47 Tests
  FAILED:     1 Tests


Failures: 
        From test_lua.vim:
        Found errors in Test_blob():
        function RunTheTest[47]..Test_blob line 3: Expected 0z00010203 but got 0z78303078.30317830.32783033
        function RunTheTest[47]..Test_blob line 4: Expected 0z8081FEFF but got 0z78383078.38317866.65786666
        function RunTheTest[47]..Test_blob line 7: Expected 0z00000000 but got 0z78303078.30307830.30783030
        function RunTheTest[47]..Test_blob line 8: Expected 4.0 but got 12.0
        function RunTheTest[47]..Test_blob line 10: Expected 0z012000FF but got 0z012000FF.30307830.30783030
        function RunTheTest[47]..Test_blob line 12: Expected 0z012000FF.7A but got 0z012000FF.7A307830.30783030
        function RunTheTest[47]..Test_blob line 13: Expected 5.0 but got 12.0
        function RunTheTest[47]..Test_blob line 16: Expected 0z012000FF.7A313261.62 but got 0z012000FF.7A307830.30783030.31326162
        function RunTheTest[47]..Test_blob line 17: Expected 9.0 but got 16.0

TEST FAILURE
make: *** [Makefile:58: report] Error 1
make: Leaving directory '/var/tmp/portage/app-editors/vim-8.1.1486/work/vim-8.1.1486/src/testdir'
 * ERROR: app-editors/vim-8.1.1486::gentoo failed (test phase)

# emerge --info =app-editors/vim-8.1.1486
Portage 2.3.66 (python 3.6.5-final-0, default/linux/amd64/17.1/desktop/plasma/systemd, gcc-8.3.0, glibc-2.29-r2, 4.19.44-gentoo x86_64)
=================================================================
                         System Settings
=================================================================
System uname: Linux-4.19.44-gentoo-x86_64-AMD_Phenom-tm-_II_X6_1100T_Processor-with-gentoo-2.6
KiB Mem:    12016168 total,    946940 free
KiB Swap:   12550140 total,  12486396 free
Timestamp of repository gentoo: Fri, 14 Jun 2019 07:15:01 +0000
Head commit of repository gentoo: 2fe34f439b9e259c79d9b1e830ce7e27670ae814
sh dash 0.5.9.1-r3
ld GNU gold (Gentoo 2.31.1 p7 2.31.1) 1.16
distcc 3.3.2 x86_64-pc-linux-gnu [enabled]
ccache version 3.6 [disabled]
app-shells/bash:          4.4_p23-r1::gentoo
dev-java/java-config:     2.2.0-r4::gentoo
dev-lang/perl:            5.28.2-r1::gentoo
dev-lang/python:          2.7.15::gentoo, 3.6.5::gentoo
dev-util/ccache:          3.6::gentoo
dev-util/cmake:           3.14.3::gentoo
dev-util/pkgconfig:       0.29.2::gentoo
sys-apps/baselayout:      2.6-r1::gentoo
sys-apps/sandbox:         2.13::gentoo
sys-devel/autoconf:       2.13-r1::gentoo, 2.69-r4::gentoo
sys-devel/automake:       1.16.1-r1::gentoo
sys-devel/binutils:       2.31.1-r6::gentoo
sys-devel/gcc:            8.3.0-r1::gentoo
sys-devel/gcc-config:     2.0::gentoo
sys-devel/libtool:        2.4.6-r3::gentoo
sys-devel/make:           4.2.1-r4::gentoo
sys-kernel/linux-headers: 4.17::gentoo (virtual/os-headers)
sys-libs/glibc:           2.29-r2::gentoo
Repositories:

gentoo
    location: /usr/portage
    sync-type: rsync
    sync-uri: rsync://rsync.europe.gentoo.org/gentoo-portage
    priority: -1000
    sync-rsync-extra-opts: 
    sync-rsync-verify-max-age: 24
    sync-rsync-verify-jobs: 1
    sync-rsync-verify-metamanifest: yes

x-portage
    location: /usr/local/portage
    masters: gentoo
    priority: 0

ACCEPT_KEYWORDS="amd64"
ACCEPT_LICENSE="* -@EULA"
CBUILD="x86_64-pc-linux-gnu"
CFLAGS="-O2 -pipe -frecord-gcc-switches -march=amdfam10 -flto=7"
CHOST="x86_64-pc-linux-gnu"
CONFIG_PROTECT="/etc /usr/lib64/libreoffice/program/sofficerc /usr/share/config /usr/share/gnupg/qualified.txt"
CONFIG_PROTECT_MASK="/etc/ca-certificates.conf /etc/dconf /etc/env.d /etc/fonts/fonts.conf /etc/gconf /etc/gentoo-release /etc/revdep-rebuild /etc/sandbox.d /etc/terminfo"
CXXFLAGS="-O2 -pipe -frecord-gcc-switches -march=amdfam10 -flto=7"
DISTDIR="/usr/portage/distfiles"
EMERGE_DEFAULT_OPTS="--keep-going y --with-bdeps y"
ENV_UNSET="DBUS_SESSION_BUS_ADDRESS DISPLAY GOBIN PERL5LIB PERL5OPT PERLPREFIX PERL_CORE PERL_MB_OPT PERL_MM_OPT XAUTHORITY XDG_CACHE_HOME XDG_CONFIG_HOME XDG_DATA_HOME XDG_RUNTIME_DIR"
FCFLAGS="-O2 -pipe -frecord-gcc-switches -march=amdfam10 -flto=7"
FEATURES="assume-digests binpkg-docompress binpkg-dostrip binpkg-logs cgroup compress-build-logs config-protect-if-modified distcc distlocks ebuild-locks ipc-sandbox merge-sync multilib-strict network-sandbox news parallel-fetch pid-sandbox preserve-libs protect-owned sandbox sfperms split-elog split-log strict test unknown-features-warn unmerge-logs unmerge-orphans userfetch userpriv usersandbox usersync xattr"
FFLAGS="-O2 -pipe -frecord-gcc-switches -march=amdfam10 -flto=7"
GENTOO_MIRRORS="http://gentoo.modulix.net/gentoo/ http://mirrors.evowise.com/gentoo/ http://ftp.fau.de/gentoo http://gentoo.mirrors.ovh.net/gentoo-distfiles/ http://ftp.snt.utwente.nl/pub/os/linux/gentoo"
LANG="it_IT.UTF-8"
LDFLAGS="-Wl,-O1 -Wl,--as-needed -Wl,--hash-style=gnu -Wl,--sort-common -flto=7"
LINGUAS="it it_IT"
MAKEOPTS="-j15 -l6"
PKGDIR="/usr/portage/packages"
PORTAGE_CONFIGROOT="/"
PORTAGE_RSYNC_OPTS="--recursive --links --safe-links --perms --times --omit-dir-times --compress --force --whole-file --delete --stats --human-readable --timeout=180 --exclude=/distfiles --exclude=/local --exclude=/packages --exclude=/.git"
PORTAGE_TMPDIR="/var/tmp"
USE="X a52 aac aalib acl acpi activities adns alsa amd64 ao audiofile bash-completion bluetooth branding bzip2 cairo caps cdda cddb cdparanoia cdr cli crypt css cups curl cxx dbus declarative dga djvu dri dts dvd dvdr emboss encode exif expat fbcon ffmpeg fftw flac fontconfig fortran ftp gd gdbm geoip gif gimp glamor gmp gnutls gphoto2 gpm graphviz gtk handbook iconv icu idn imagemagick imlib ipv6 java javascript jbig jpeg jpeg2k kde kipi kwallet lame lcms libass libcaca libnotify libsamplerate libtirpc lm_sensors lua lzma lzo mad mmap mng mp3 mp4 mpeg mplayer multilib musicbrainz ncurses nls nptl nsplugin offensive ogg openal opengl openmp pam pango pcre pdf phonon plasma png policykit postscript ppds pulseaudio qml qt5 rdesktop readline recode samba scanner sctp sdl seccomp sndfile sockets speex spell sqlite sqlite3 ssl startup-notification svg symlink syslog systemd sysvipc taglib test theora threads tidy tiff truetype udev udisks unicode upower usb vaapi vcd vdpau vim-syntax vnc vorbis wayland widgets win32codecs wmf wxwidgets x264 xattr xcb xcomposite xine xml xpm xscreensaver xv xvid yahoo zlib" ABI_X86="64" ALSA_CARDS="hda-intel virmidi" APACHE2_MODULES="authn_core authz_core socache_shmcb unixd actions alias auth_basic authn_alias authn_anon authn_dbm authn_default authn_file authz_dbm authz_default authz_groupfile authz_host authz_owner authz_user autoindex cache cgi cgid dav dav_fs dav_lock deflate dir disk_cache env expires ext_filter file_cache filter headers include info log_config logio mem_cache mime mime_magic negotiation rewrite setenvif speling status unique_id userdir usertrack vhost_alias" CALLIGRA_FEATURES="karbon sheets words" CAMERAS="kodak ptp2" COLLECTD_PLUGINS="df interface irq load memory rrdtool swap syslog" CPU_FLAGS_X86="3dnow 3dnowext mmx mmxext popcnt sse sse2 sse3 sse4a" CURL_SSL="gnutls" ELIBC="glibc" GPSD_PROTOCOLS="ashtech aivdm earthmate evermore fv18 garmin garmintxt gpsclock isync itrax mtk3301 nmea ntrip navcom oceanserver oldstyle oncore rtcm104v2 rtcm104v3 sirf skytraq superstar2 timing tsip tripmate tnt ublox ubx" GRUB_PLATFORMS="pc" INPUT_DEVICES="libinput" KERNEL="linux" L10N="it en" LCD_DEVICES="bayrad cfontz cfontz633 glk hd44780 lb216 lcdm001 mtxorb ncurses text" LIBREOFFICE_EXTENSIONS="nlpsolver" NETBEANS_MODULES="apisupport cnd groovy gsf harness ide identity j2ee java mobility nb php profiler soa visualweb webcommon websvccommon xml" OFFICE_IMPLEMENTATION="libreoffice" PHP_TARGETS="php7-2" POSTGRES_TARGETS="postgres10 postgres11" PYTHON_SINGLE_TARGET="python3_6" PYTHON_TARGETS="python2_7 python3_6 pypy pypy3" RUBY_TARGETS="ruby24" SANE_BACKENDS="epson epson2" USERLAND="GNU" VIDEO_CARDS="radeon r600" XTABLES_ADDONS="quota2 psd pknock lscan length2 ipv4options ipset ipp2p iface geoip fuzzy condition tee tarpit sysrq steal rawnat logmark ipmark dhcpmac delude chaos account"
Unset:  CC, CPPFLAGS, CTARGET, CXX, INSTALL_MASK, LC_ALL, PORTAGE_BINHOST, PORTAGE_BUNZIP2_COMMAND, PORTAGE_COMPRESS, PORTAGE_COMPRESS_FLAGS, PORTAGE_RSYNC_EXTRA_OPTS

# emerge -1pqv =app-editors/vim-8.1.1486
[ebuild     U ] app-editors/vim-8.1.1486 [8.1.0648-r1] USE="X acl gpm lua nls -cscope -debug -luajit -minimal -perl -python -racket -ruby (-selinux) -tcl -terminal -vim-pager" PYTHON_SINGLE_TARGET="python3_6 -python2_7 -python3_5 (-python3_7)" PYTHON_TARGETS="python2_7 python3_6 -python3_5 (-python3_7)"

Adding "luajit" to USE flags, tests work out fine.