Gentoo Websites Logo
Go to: Gentoo Home Documentation Forums Lists Bugs Planet Store Wiki Get Gentoo!
Bug 687360 - dev-lang/R-3.5.3 : [TEST] running code in reg-tests-1d.R make[3]: *** [Makefile.common:105: reg-tests-1d.Rout] Error 1
Summary: dev-lang/R-3.5.3 : [TEST] running code in reg-tests-1d.R make[3]: *** [Makefi...
Status: CONFIRMED
Alias: None
Product: Gentoo Linux
Classification: Unclassified
Component: Current packages (show other bugs)
Hardware: All Linux
: Normal normal (vote)
Assignee: Gentoo Science Mathematics related packages
URL:
Whiteboard:
Keywords: TESTFAILURE
Depends on:
Blocks:
 
Reported: 2019-06-04 15:13 UTC by Toralf Förster
Modified: 2020-04-18 01:22 UTC (History)
2 users (show)

See Also:
Package list:
Runtime testing required: ---


Attachments
emerge-info.txt (emerge-info.txt,19.86 KB, text/plain)
2019-06-04 15:13 UTC, Toralf Förster
Details
dev-lang:R-3.5.3:20190604-045923.log (dev-lang:R-3.5.3:20190604-045923.log,276.12 KB, text/plain)
2019-06-04 15:14 UTC, Toralf Förster
Details
emerge-history.txt (emerge-history.txt,108.29 KB, text/plain)
2019-06-04 15:14 UTC, Toralf Förster
Details
environment (environment,88.81 KB, text/plain)
2019-06-04 15:14 UTC, Toralf Förster
Details
etc.portage.tbz2 (etc.portage.tbz2,12.89 KB, application/x-bzip)
2019-06-04 15:14 UTC, Toralf Förster
Details
logs.tbz2 (logs.tbz2,35.94 KB, application/x-bzip)
2019-06-04 15:14 UTC, Toralf Förster
Details
temp.tbz2 (temp.tbz2,48.15 KB, application/x-bzip)
2019-06-04 15:14 UTC, Toralf Förster
Details

Note You need to log in before you can comment on or make changes to this bug.
Description Toralf Förster gentoo-dev 2019-06-04 15:13:56 UTC
running code in 'reg-tests-1b.R' ... OK
running code in 'reg-tests-1c.R' ... OK
running code in 'reg-tests-1d.R' ...make[3]: *** [Makefile.common:105: reg-tests-1d.Rout] Error 1
make[3]: Leaving directory '/var/tmp/portage/dev-lang/R-3.5.3/work/R-3.5.3/tests'
make[2]: *** [Makefile.common:291: test-Reg] Error 2
make[2]: Leaving directory '/var/tmp/portage/dev-lang/R-3.5.3/work/R-3.5.3/tests'

  -------------------------------------------------------------------

  This is an unstable amd64 chroot image at a tinderbox (==build bot)
  name: 17.1-desktop-plasma_test_20190531-023321

  -------------------------------------------------------------------

gcc-config -l:
 [1] x86_64-pc-linux-gnu-7.3.1
 [2] x86_64-pc-linux-gnu-8.3.1
 [3] x86_64-pc-linux-gnu-9.1.0 *

Available Python interpreters, in order of preference:
  [1]   python3.6
  [2]   python2.7 (fallback)

Available Rust versions:
  [1]   rust-1.35.0 *
java-config:
The following VMs are available for generation-2:
*)	IcedTea JDK 3.12.0 [icedtea-bin-8]
Available Java Virtual Machines:
  [1]   icedtea-bin-8  system-vm

emerge -qpvO dev-lang/R
[ebuild  N    ] dev-lang/R-3.5.3  USE="X cairo jpeg nls openmp png readline tiff -doc -icu -java -lapack -minimal -perl (-prefix) -profile -static-libs -tk"
Comment 1 Toralf Förster gentoo-dev 2019-06-04 15:13:58 UTC
Created attachment 578734 [details]
emerge-info.txt
Comment 2 Toralf Förster gentoo-dev 2019-06-04 15:14:01 UTC
Created attachment 578736 [details]
dev-lang:R-3.5.3:20190604-045923.log
Comment 3 Toralf Förster gentoo-dev 2019-06-04 15:14:04 UTC
Created attachment 578738 [details]
emerge-history.txt
Comment 4 Toralf Förster gentoo-dev 2019-06-04 15:14:07 UTC
Created attachment 578740 [details]
environment
Comment 5 Toralf Förster gentoo-dev 2019-06-04 15:14:10 UTC
Created attachment 578742 [details]
etc.portage.tbz2
Comment 6 Toralf Förster gentoo-dev 2019-06-04 15:14:12 UTC
Created attachment 578744 [details]
logs.tbz2
Comment 7 Toralf Förster gentoo-dev 2019-06-04 15:14:15 UTC
Created attachment 578746 [details]
temp.tbz2