Gentoo Websites Logo
Go to: Gentoo Home Documentation Forums Lists Bugs Planet Store Wiki Get Gentoo!
Bug 670362 - media-libs/netpbm-10.70.00 fails test ps-alt-roundtrip.test after upgrade to app-text/ghostscript-gpl-9.25
Summary: media-libs/netpbm-10.70.00 fails test ps-alt-roundtrip.test after upgrade to ...
Status: UNCONFIRMED
Alias: None
Product: Gentoo Linux
Classification: Unclassified
Component: Current packages (show other bugs)
Hardware: All Linux
: Normal normal (vote)
Assignee: Gentoo Graphics Project
URL:
Whiteboard:
Keywords: TESTFAILURE
Depends on:
Blocks:
 
Reported: 2018-11-05 11:46 UTC by Paolo Pedroni
Modified: 2018-11-13 11:35 UTC (History)
0 users

See Also:
Package list:
Runtime testing required: ---


Attachments
netpbm-10.70.00:20181105-105434.log.gz (netpbm-10.70.00:20181105-105434.log.gz,46.92 KB, application/gzip)
2018-11-05 11:46 UTC, Paolo Pedroni
Details

Note You need to log in before you can comment on or make changes to this bug.
Description Paolo Pedroni 2018-11-05 11:46:11 UTC
Created attachment 554126 [details]
netpbm-10.70.00:20181105-105434.log.gz

== ps-alt-roundtrip.test ==
pbmtopsg3: [1]

## If ps-roundtrip.test succeeds and this test fails, it is most likely
## a problem with one of the alternate Postscipt utilities:
## pbmtoepsi, pbmtopsg3, pbmtolps or psidtopgm.
## If both tests fail it indicates a problem with pstopnm or gs.
ps-alt-roundtrip.test: FAILURE

[...SKIP...]

Test summary:
==================
SUCCESS 104
FAILURE 1
TOTAL TESTABLE 105
==================
All tests done.
Mon, 05 Nov 2018 10:55:42 +0000
make: *** [GNUmakefile:452: check] Error 1
 * ERROR: media-libs/netpbm-10.70.00::gentoo failed (test phase):
 *   emake failed

The failing subtest is the second:

    # Test 2. Should print: 2425386270 41
    testgrid2_ps=${tmpdir}/testgrid2.ps
    
    pbmtolps -dpi 72 testgrid.pbm \
         > ${testgrid2_ps} && \
    pstopnm -xborder=0 -yborder=0 -dpi=72 -stdout \
        -quiet ${testgrid2_ps} -pbm | \
      pnmcrop | cksum
    
    rm ${testgrid2_ps}

it should print "2425386270 41", but instead prints "2723935441 43" even when run manually. Test #1 and test #3 work fine.

Same thing happens with netpbm-10.76.00.

# emerge --info =media-libs/netpbm-10.70.00
Portage 2.3.49 (python 3.6.5-final-0, default/linux/amd64/17.1/desktop, gcc-8.2.0, glibc-2.27-r6, 4.18.16-gentoo x86_64)
=================================================================
                         System Settings
=================================================================
System uname: Linux-4.18.16-gentoo-x86_64-AMD_Phenom-tm-_II_X4_965_Processor-with-gentoo-2.4.1
KiB Mem:    12265804 total,   4536016 free
KiB Swap:    8351740 total,   8339952 free
Timestamp of repository gentoo: Sat, 03 Nov 2018 11:15:01 +0000
Head commit of repository gentoo: 2d6715cd9bf62f28d1ad730db7d7bbc71a1906b3
sh dash 0.5.9.1-r3
ld GNU gold (Gentoo 2.30 p5 2.30.0) 1.15
distcc 3.2rc1 x86_64-pc-linux-gnu [enabled]
ccache version 3.3.4 [disabled]
app-shells/bash:          4.4_p12::gentoo
dev-lang/perl:            5.26.2::gentoo
dev-lang/python:          2.7.15::gentoo, 3.6.5::gentoo
dev-util/ccache:          3.3.4-r1::gentoo
dev-util/cmake:           3.9.6::gentoo
dev-util/pkgconfig:       0.29.2::gentoo
sys-apps/baselayout:      2.4.1-r2::gentoo
sys-apps/sandbox:         2.13::gentoo
sys-devel/autoconf:       2.13::gentoo, 2.69-r4::gentoo
sys-devel/automake:       1.15.1-r2::gentoo
sys-devel/binutils:       2.30-r4::gentoo
sys-devel/gcc:            8.2.0-r4::gentoo
sys-devel/gcc-config:     2.0::gentoo
sys-devel/libtool:        2.4.6-r3::gentoo
sys-devel/make:           4.2.1-r4::gentoo
sys-kernel/linux-headers: 4.17::gentoo (virtual/os-headers)
sys-libs/glibc:           2.27-r6::gentoo
Repositories:

gentoo
    location: /usr/portage
    sync-type: rsync
    sync-uri: rsync://rsync.europe.gentoo.org/gentoo-portage
    priority: -1000
    sync-rsync-verify-metamanifest: yes
    sync-rsync-verify-max-age: 24
    sync-rsync-extra-opts: 
    sync-rsync-verify-jobs: 1

x-portage
    location: /usr/local/portage
    masters: gentoo
    priority: 0

ACCEPT_KEYWORDS="amd64"
ACCEPT_LICENSE="* -@EULA"
CBUILD="x86_64-pc-linux-gnu"
CFLAGS="-O2 -pipe -march=amdfam10 -msahf -mlzcnt -mpopcnt --param l1-cache-size=64 --param l1-cache-line-size=64 --param l2-cache-size=512 -flto=5"
CHOST="x86_64-pc-linux-gnu"
CONFIG_PROTECT="/etc /usr/lib64/libreoffice/program/sofficerc /usr/share/config /usr/share/gnupg/qualified.txt"
CONFIG_PROTECT_MASK="/etc/ca-certificates.conf /etc/dconf /etc/env.d /etc/fonts/fonts.conf /etc/gconf /etc/gentoo-release /etc/revdep-rebuild /etc/sandbox.d /etc/terminfo"
CXXFLAGS="-O2 -pipe -march=amdfam10 -msahf -mlzcnt -mpopcnt --param l1-cache-size=64 --param l1-cache-line-size=64 --param l2-cache-size=512 -flto=5"
DISTDIR="/usr/portage/distfiles"
EMERGE_DEFAULT_OPTS="--keep-going y --with-bdeps y"
ENV_UNSET="DBUS_SESSION_BUS_ADDRESS DISPLAY PERL5LIB PERL5OPT PERLPREFIX PERL_CORE PERL_MB_OPT PERL_MM_OPT XAUTHORITY XDG_CACHE_HOME XDG_CONFIG_HOME XDG_DATA_HOME XDG_RUNTIME_DIR"
FCFLAGS="-O2 -pipe"
FEATURES="assume-digests binpkg-logs cgroup compress-build-logs config-protect-if-modified distcc distlocks ebuild-locks ipc-sandbox merge-sync multilib-strict network-sandbox news parallel-fetch preserve-libs protect-owned sandbox sfperms split-elog split-log strict test unknown-features-warn unmerge-logs unmerge-orphans userfetch userpriv usersandbox usersync xattr"
FFLAGS="-O2 -pipe"
GENTOO_MIRRORS="http://ftp-stud.hs-esslingen.de/pub/Mirrors/gentoo/ ftp://mirror.switch.ch/mirror/gentoo/ http://gentoo.mirror.dkm.cz/pub/gentoo/ http://ftp.halifax.rwth-aachen.de/gentoo/ http://ftp.uni-erlangen.de/pub/mirrors/gentoo"
LANG="it_IT.UTF-8"
LDFLAGS="-Wl,-O1 -Wl,--as-needed -Wl,--hash-style=gnu -Wl,--sort-common -flto=5"
MAKEOPTS="-j12 -l4"
PKGDIR="/usr/portage/packages"
PORTAGE_CONFIGROOT="/"
PORTAGE_RSYNC_OPTS="--recursive --links --safe-links --perms --times --omit-dir-times --compress --force --whole-file --delete --stats --human-readable --timeout=180 --exclude=/distfiles --exclude=/local --exclude=/packages --exclude=/.git"
PORTAGE_TMPDIR="/var/tmp"
USE="3dnow X a52 aac aalib acl acpi alsa amd64 ao audiofile bash-completion bluetooth branding bzip2 cairo caps cdda cddb cdparanoia cdr cli consolekit crypt css cups curl cxx dbus dga djvu dri dts dvd dvdr emboss encode exif expat fbcon ffmpeg fftw flac fontconfig fortran ftp gd gdbm gif glamor gmp gnutls gpm graphviz gtk iconv icu idn ieee1394 imagemagick imlib inotify introspection ipv6 jbig jpeg jpeg2k kde lame lcms libass libcaca libnotify libsamplerate libtirpc lm_sensors lua lzma lzo mad mmap mng mp3 mp4 mpeg mplayer multilib musicbrainz ncurses nls nptl nsplugin offensive ogg openal opengl openmp pam pango pcre pdf png policykit postscript ppds pulseaudio qt5 rdesktop readline samba sctp sdl seccomp sndfile speex spell sqlite ssl startup-notification svg symlink syslog systemd taglib test theora threads tiff truetype udev udisks unicode upower usb vaapi vcd vdpau vim-syntax vorbis wavpack wayland win32codecs wmf wxwidgets x264 xattr xcb xcomposite xine xinerama xml xpm xscreensaver xv xvid zlib" ABI_X86="64" ALSA_CARDS="hda-intel virmidi" APACHE2_MODULES="authn_core authz_core socache_shmcb unixd actions alias auth_basic authn_alias authn_anon authn_dbm authn_default authn_file authz_dbm authz_default authz_groupfile authz_host authz_owner authz_user autoindex cache cgi cgid dav dav_fs dav_lock deflate dir disk_cache env expires ext_filter file_cache filter headers include info log_config logio mem_cache mime mime_magic negotiation rewrite setenvif speling status unique_id userdir usertrack vhost_alias" CALLIGRA_FEATURES="karbon plan sheets stage words" CAMERAS="kodak ptp2" COLLECTD_PLUGINS="df interface irq load memory rrdtool swap syslog" CPU_FLAGS_X86="3dnow 3dnowext mmx mmxext popcnt sse sse2 sse3 sse4a" CURL_SSL="gnutls" ELIBC="glibc" GPSD_PROTOCOLS="ashtech aivdm earthmate evermore fv18 garmin garmintxt gpsclock isync itrax mtk3301 nmea ntrip navcom oceanserver oldstyle oncore rtcm104v2 rtcm104v3 sirf skytraq superstar2 timing tsip tripmate tnt ublox ubx" GRUB_PLATFORMS="pc" INPUT_DEVICES="libinput" KERNEL="linux" L10N="it en" LCD_DEVICES="bayrad cfontz cfontz633 glk hd44780 lb216 lcdm001 mtxorb ncurses text" OFFICE_IMPLEMENTATION="libreoffice" PHP_TARGETS="php5-6 php7-1" POSTGRES_TARGETS="postgres9_5 postgres10" PYTHON_SINGLE_TARGET="python3_6" PYTHON_TARGETS="python2_7 python3_6 pypy pypy3" RUBY_TARGETS="ruby23" USERLAND="GNU" VIDEO_CARDS="radeon r600" XTABLES_ADDONS="quota2 psd pknock lscan length2 ipv4options ipset ipp2p iface geoip fuzzy condition tee tarpit sysrq steal rawnat logmark ipmark dhcpmac delude chaos account"
Unset:  CC, CPPFLAGS, CTARGET, CXX, INSTALL_MASK, LC_ALL, LINGUAS, PORTAGE_BINHOST, PORTAGE_BUNZIP2_COMMAND, PORTAGE_COMPRESS, PORTAGE_COMPRESS_FLAGS, PORTAGE_RSYNC_EXTRA_OPTS

=================================================================
                        Package Settings
=================================================================

media-libs/netpbm-10.70.00::gentoo was built with the following:
USE="X jbig jpeg jpeg2k png tiff xml zlib -doc -rle -static-libs (-svga)" ABI_X86="(64)" CPU_FLAGS_X86="sse2"

# emerge -1pqv =media-libs/netpbm-10.70.00
[ebuild   R   ] media-libs/netpbm-10.70.00  USE="X jbig jpeg jpeg2k png tiff xml zlib -doc -rle -static-libs (-svga)" CPU_FLAGS_X86="sse2"
Comment 1 Paolo Pedroni 2018-11-05 12:05:23 UTC
Last time I emerged media-libs/netpbm (September 10th), all tests ran fine, and as far as I can determine, no dependency of netpbm has changed since then.
Comment 2 Paolo Pedroni 2018-11-05 12:12:31 UTC
Downgrading to ghostscript-gpl-9.21 and rebuilding media-libs/netpbm makes tests pass successfully.
Comment 3 Andreas Sturmlechner gentoo-dev 2018-11-13 11:02:07 UTC
Can you reproduce the problem with 10.76.00?
Comment 4 Paolo Pedroni 2018-11-13 11:35:26 UTC
(In reply to Andreas Sturmlechner from comment #3)
> Can you reproduce the problem with 10.76.00?

As I said in the OP, the same thing happens with 10.76.00 (unless the ebuild changed in the meantime).