Gentoo Websites Logo
Go to: Gentoo Home Documentation Forums Lists Bugs Planet Store Wiki Get Gentoo!
Bug 416877 - net-wireless/wpa_supplicant with gcc-4.7: fails with function not declared in this scope
Summary: net-wireless/wpa_supplicant with gcc-4.7: fails with function not declared in...
Status: RESOLVED DUPLICATE of bug 409285
Alias: None
Product: Gentoo Linux
Classification: Unclassified
Component: [OLD] Unspecified (show other bugs)
Hardware: All Linux
: Normal normal (vote)
Assignee: Gentoo Linux bug wranglers
Depends on:
Blocks: gcc-4.7
  Show dependency tree
Reported: 2012-05-21 09:25 UTC by Nicolas Schlumberger
Modified: 2012-05-22 06:25 UTC (History)
0 users

See Also:
Package list:
Runtime testing required: ---

wpa_supplicant-1.0-gcc04.7.patch (wpa_supplicant-1.0-gcc-4.7.patch,429 bytes, text/plain)
2012-05-21 10:37 UTC, Nicolas Schlumberger

Note You need to log in before you can comment on or make changes to this bug.
Description Nicolas Schlumberger 2012-05-21 09:25:44 UTC
x86_64-pc-linux-gnu-g++ -c -march=native -O2 -pipe -floop-interchange -floop-strip-mine -floop-block -Wall -W -D_REENTRANT -DCONFIG_CTRL_IFACE -DCONFIG_CTRL_IFACE_UNIX -DQT_NO_DEBUG -DQT_GUI_LIB -DQT_CORE_LIB -DQT_SHARED -I/usr/share/qt4/mkspecs/linux-g++ -I. -I/usr/include/qt4/QtCore -I/usr/include/qt4/QtGui -I/usr/include/qt4 -I. -I.. -I../../src -I../../src/utils -I.moc -I.ui -o .obj/addinterface.o addinterface.cpp
wpagui.cpp: In member function ‘virtual void WpaGui::parse_argv()’:
wpagui.cpp:246:49: error: ‘getopt’ was not declared in this scope
wpagui.cpp:252:24: error: ‘optarg’ was not declared in this scope
x86_64-pc-linux-gnu-g++ -c -march=native -O2 -pipe -floop-interchange -floop-strip-mine -floop-block -Wall -W -D_REENTRANT -DCONFIG_CTRL_IFACE -DCONFIG_CTRL_IFACE_UNIX -DQT_NO_DEBUG -DQT_GUI_LIB -DQT_CORE_LIB -DQT_SHARED -I/usr/share/qt4/mkspecs/linux-g++ -I. -I/usr/include/qt4/QtCore -I/usr/include/qt4/QtGui -I/usr/include/qt4 -I. -I.. -I../../src -I../../src/utils -I.moc -I.ui -o .obj/peers.o peers.cpp
make: *** [.obj/wpagui.o] Error 1
make: *** Waiting for unfinished jobs....
 * ERROR: net-wireless/wpa_supplicant-1.0 failed (compile phase):
 *   emake failed
 * If you need support, post the output of `emerge --info '=net-wireless/wpa_supplicant-1.0'`,
 * the complete build log and the output of `emerge -pqv '=net-wireless/wpa_supplicant-1.0'`.
 * The complete build log is located at '/var/log/portage/net-wireless:wpa_supplicant-1.0:20120521-090611.log'.
 * For convenience, a symlink to the build log is located at '/var/tmp/portage/net-wireless/wpa_supplicant-1.0/temp/build.log'.
 * The ebuild environment file is located at '/var/tmp/portage/net-wireless/wpa_supplicant-1.0/temp/environment'.
 * Working directory: '/var/tmp/portage/net-wireless/wpa_supplicant-1.0/work/wpa_supplicant-1.0/wpa_supplicant/wpa_gui-qt4'
 * S: '/var/tmp/portage/net-wireless/wpa_supplicant-1.0/work/wpa_supplicant-1.0/wpa_supplicant'

Reproducible: Always

Actual Results:  
Portage 2.2.0_alpha107 (hardened/linux/amd64/desktop, gcc-4.7.0, glibc-2.15-r2, 3.3.6-hardened x86_64)
System uname: Linux-3.3.6-hardened-x86_64-Intel-R-_Core-TM-_i7-2620M_CPU_@_2.70GHz-with-gentoo-2.1
Timestamp of tree: Sun, 20 May 2012 22:45:01 +0000
app-shells/bash:          4.2_p28
dev-java/java-config:     2.1.11-r3
dev-lang/python:          2.7.3-r2, 3.2.3-r1
dev-util/cmake:           2.8.8-r2
dev-util/pkgconfig:       0.26
sys-apps/baselayout:      2.1-r1
sys-apps/sandbox:         2.5
sys-devel/autoconf:       2.13, 2.69
sys-devel/automake:       1.11.5
sys-devel/binutils:       2.22-r1
sys-devel/gcc:            4.6.3::hardened-dev, 4.7.0::hardened-dev
sys-devel/gcc-config:     1.7.1
sys-devel/libtool:        2.4.2
sys-devel/make:           3.82-r3
sys-kernel/linux-headers: 3.3 (virtual/os-headers)
sys-libs/glibc:           2.15-r2
Repositories: gentoo kde hardened-dev local
Installed sets: @kde-telepathy, @kdeaccessibility-4.8, @kdeadmin-4.8, @kdeartwork-4.8, @kdebase-4.8, @kdegraphics-4.8, @kdelibs-4.8, @kdemultimedia-4.8, @kdenetwork-4.8, @kdepim-4.8, @kdetoys-4.8, @kdeutils-4.8, @system
ACCEPT_KEYWORDS="amd64 ~amd64"
CFLAGS="-march=native -O2 -pipe -floop-interchange -floop-strip-mine -floop-block"
CONFIG_PROTECT="/etc /usr/share/config /usr/share/gnupg/qualified.txt /usr/share/openvpn/easy-rsa"
CONFIG_PROTECT_MASK="/etc/ca-certificates.conf /etc/env.d /etc/env.d/java/ /etc/fonts/fonts.conf /etc/gconf /etc/gentoo-release /etc/revdep-rebuild /etc/sandbox.d /etc/splash /etc/terminfo /etc/texmf/language.dat.d /etc/texmf/language.def.d /etc/texmf/updmap.d /etc/texmf/web2c"
CXXFLAGS="-march=native -O2 -pipe -floop-interchange -floop-strip-mine -floop-block"
EMERGE_DEFAULT_OPTS="--misspell-suggestions=n --jobs=3"
FEATURES="assume-digests binpkg-logs config-protect-if-modified distlocks ebuild-locks fixlafiles news parallel-fetch parse-eapi-ebuild-head preserve-libs protect-owned sandbox sfperms strict unknown-features-warn unmerge-logs unmerge-orphans userfetch usersandbox usersync xattr"
LDFLAGS="-Wl,-O1 -Wl,--as-needed -Wl,--sort-common -Wl,-z,relro -Wl,-z,now"
LINGUAS="en en_US"
MAKEOPTS="-j5 -l11"
PORTAGE_RSYNC_OPTS="--recursive --links --safe-links --perms --times --compress --force --whole-file --delete --stats --human-readable --timeout=180 --exclude=/distfiles --exclude=/local --exclude=/packages"
PORTDIR_OVERLAY="/var/lib/layman/kde /var/lib/layman/hardened-development /usr/local/portage"
USE="X a52 aac acl acpi alsa amd64 bash-completion berkdb bluetooth branding bzip2 c++0x cairo caps cli consolekit cracklib crypt cups cxx dbus dri dts dvd emboss encode exif expat fam ffmpeg fftw firefox flac gdbm gif gpm gstreamer handbook hardened iconv icu idn introspection ipv6 jpeg justify kde kerberos lcms ldap libedit libnotify logrotate lzma mad mmx mng modules mp3 mp4 mpeg mpi mudflap multilib mysql ncurses networkmanager nls nptl offensive ogg openexr opengl openmp pam pango pax_kernel pcre pdf png policykit ppds pppd qt3support qt4 sdl semantic-desktop session smp spell sqlite sse sse2 ssl svg syslog tcpd theora threads tiff truetype udev udisks unicode upower urandom usb v4l v4l2 vim-syntax vorbis wxwidgets x264 xattr xcb xml xorg xulrunner xv xvid zlib" ALSA_CARDS="hda-intel" ALSA_PCM_PLUGINS="adpcm alaw asym copy dmix dshare dsnoop empty extplug file hooks iec958 ioplug ladspa lfloat linear meter mmap_emul mulaw multi null plug rate route share shm softvol" APACHE2_MODULES="actions alias auth_basic authn_alias authn_anon authn_dbm authn_default authn_file authz_dbm authz_default authz_groupfile authz_host authz_owner authz_user autoindex cache cgi cgid dav dav_fs dav_lock deflate dir disk_cache env expires ext_filter file_cache filter headers include info log_config logio mem_cache mime mime_magic negotiation rewrite setenvif speling status unique_id userdir usertrack vhost_alias" CALLIGRA_FEATURES="kexi words flow plan sheets stage tables krita karbon braindump" CAMERAS="ptp2" COLLECTD_PLUGINS="df interface irq load memory rrdtool swap syslog" DRACUT_MODULES="biosdevname btrfs caps crypt crypt-gpg syslog" ELIBC="glibc" GPSD_PROTOCOLS="ashtech aivdm earthmate evermore fv18 garmin garmintxt gpsclock itrax mtk3301 nmea ntrip navcom oceanserver oldstyle oncore rtcm104v2 rtcm104v3 sirf superstar2 timing tsip tripmate tnt ubx" GRUB_PLATFORMS="efi-64 pc" INPUT_DEVICES="evdev synaptics" KERNEL="linux" LCD_DEVICES="bayrad cfontz cfontz633 glk hd44780 lb216 lcdm001 mtxorb ncurses text" LIBREOFFICE_EXTENSIONS="presenter-console presenter-minimizer" LINGUAS="en en_US" PHP_TARGETS="php5-3" PYTHON_TARGETS="python3_2 python2_7" RUBY_TARGETS="ruby19" USERLAND="GNU" VIDEO_CARDS="intel vesa v4l v4l2" XTABLES_ADDONS="quota2 psd pknock lscan length2 ipv4options ipset ipp2p iface geoip fuzzy condition tee tarpit sysrq steal rawnat logmark ipmark dhcpmac delude chaos account"
USE_PYTHON="2.7 3.2"
Comment 1 Nicolas Schlumberger 2012-05-21 10:37:10 UTC
Created attachment 312485 [details]

patch to fix missing #include <unistd.h>
Comment 2 Ryan Hill (RETIRED) gentoo-dev 2012-05-22 06:25:39 UTC

*** This bug has been marked as a duplicate of bug 409285 ***