Gentoo Websites Logo
Go to: Gentoo Home Documentation Forums Lists Bugs Planet Store Wiki Get Gentoo!
Bug 285706 - [FEATURES=test failure] gnome-base/gnome-vfs-2.24.3-r1 fails tests
Summary: [FEATURES=test failure] gnome-base/gnome-vfs-2.24.3-r1 fails tests
Status: RESOLVED UPSTREAM
Alias: None
Product: Gentoo Linux
Classification: Unclassified
Component: New packages (show other bugs)
Hardware: All Linux
: High normal (vote)
Assignee: Gentoo Linux Gnome Desktop Team
URL: https://bugzilla.gnome.org/show_bug.c...
Whiteboard:
Keywords: NeedPatch
Depends on:
Blocks: gnome-tests gnome2.24
  Show dependency tree
 
Reported: 2009-09-20 14:07 UTC by Patrick Lauer
Modified: 2010-10-02 11:57 UTC (History)
0 users

See Also:
Package list:
Runtime testing required: ---


Attachments
build.log (gnome-vfs-2.24.3-r1:20100505-220612.log,405.61 KB, text/plain)
2010-05-08 08:47 UTC, Pacho Ramos
Details

Note You need to log in before you can comment on or make changes to this bug.
Description Patrick Lauer gentoo-dev 2009-09-20 14:07:50 UTC
make  check-TESTS                                                                                                                                                                 
make[2]: Entering directory `/var/tmp/portage/gnome-base/gnome-vfs-2.24.1/work/gnome-vfs-2.24.1/test'                                                                             
ACL auto test mode                                                                                                                                                                
Testing ACE Object                                                                                                                                                                
Testing ACL Object                                                                                                                                                                
PASS: test-acl                                                                                                                                                                    
Testing GnomeVFSAddress                                                                                                                                                           
PASS: test-address                                                                                                                                                                
Testing get file info...                                                                                                                                                          
** Message: test failed: get_file_info 1: callback was not called                                                                                                                 
** Message: test failed: get_file_info 1: job never went away                                                                                                                     
** Message: test failed: get_file_info, bad handle                                                                                                                                
** Message: test failed: get_file_info, bad handle                                                                                                                                
** Message: test failed: get_file_info 2: callback was called                                                                                                                     
Testing open, close...                                                                                                                                                            
Testing read, close...                                                                                                                                                            
Testing cancellation...                                                                                                                                                           
Testing failed opens...                                                                                                                                                           
Testing read, cancel, closes...                                                                                                                                                   
Testing directory loads.** Message: test failed: load directory cancel 2: job never went away delay 1                                                                             
.** Message: test failed: load directory cancel 1: job never went away delay 0                                                                                                    
.
Testing directory finds...
Testing shutdown...
FAIL: test-async-cancel
PASS: test-escape
GConf Error: Failed to contact configuration server; some possible causes are that you need to enable TCP/IP networking for ORBit, or you have stale NFS locks due to a system crash. See http://projects.gnome.org/gconf/ for information. (Details -  1: Failed to get connection to session: Did not receive a reply. Possible causes include: the remote application did not send a reply, the message bus security policy blocked the reply, the reply timeout expired, or the network connection was broken.)
PASS: test-uri
Initializing gnome-vfs...
Creating async context...
Starting open for `./test.input'...
Main loop running.
Open failed: Invalid URI.
Main loop finished.
Test async queue efficiency ...Passed
All done
Test passed
PASS: ./auto-test
===================
1 of 6 tests failed
===================
make[2]: *** [check-TESTS] Error 1
make[2]: Leaving directory `/var/tmp/portage/gnome-base/gnome-vfs-2.24.1/work/gnome-vfs-2.24.1/test'
make[1]: *** [check-am] Error 2
make[1]: Leaving directory `/var/tmp/portage/gnome-base/gnome-vfs-2.24.1/work/gnome-vfs-2.24.1/test'
make: *** [check-recursive] Error 1
 *
 * ERROR: gnome-base/gnome-vfs-2.24.1 failed.

Portage 2.2_rc41 (default/linux/amd64/2008.0, gcc-4.4.1, glibc-2.10.1-r0, 2.6.30-gentoo-r1 x86_64)
=================================================================
System uname: Linux-2.6.30-gentoo-r1-x86_64-AMD_Phenom-tm-_9950_Quad-Core_Processor-with-gentoo-2.0.1
Timestamp of tree: Unknown
app-shells/bash:     4.0_p33
dev-lang/python:     2.6.2-r1, 3.1.1
dev-util/cmake:      2.6.4-r2
sys-apps/baselayout: 2.0.1
sys-apps/openrc:     0.4.3-r3
sys-apps/sandbox:    2.1
sys-devel/autoconf:  2.13, 2.63-r1
sys-devel/automake:  1.10.2, 1.11
sys-devel/binutils:  2.19.1-r1
sys-devel/gcc-config: 1.4.1
sys-devel/libtool:   2.2.6a
virtual/os-headers:  2.6.30-r1
ACCEPT_KEYWORDS="amd64 ~amd64"
CBUILD="x86_64-pc-linux-gnu"
CFLAGS="-O2 -pipe"
CHOST="x86_64-pc-linux-gnu"
CONFIG_PROTECT="/etc /usr/kde/4.3/env /usr/kde/4.3/share/config /usr/kde/4.3/shutdown /usr/kde/4.4/env /usr/kde/4.4/share/config /usr/kde/4.4/shutdown /usr/kde/live/env /usr/kde/live/share/config /usr/kde/live/shutdown /usr/share/config"
CONFIG_PROTECT_MASK="/etc/ca-certificates.conf /etc/env.d /etc/env.d/java/ /etc/eselect/postgresql /etc/fonts/fonts.conf /etc/gconf /etc/gentoo-release /etc/revdep-rebuild /etc/sandbox.d /etc/terminfo /etc/texmf/language.dat.d /etc/texmf/language.def.d /etc/texmf/updmap.d /etc/texmf/web2c /etc/udev/rules.d"
CXXFLAGS="-O2 -pipe"
DISTDIR="/usr/portage/distfiles"
FEATURES="assume-digests buildpkg distlocks fixpackages parallel-fetch preserve-libs protect-owned sandbox sfperms strict unmerge-logs unmerge-orphans userfetch"
GENTOO_MIRRORS="http://distfiles.gentoo.org http://distro.ibiblio.org/pub/linux/distributions/gentoo"
LDFLAGS="-Wl,-O1"
MAKEOPTS="-j5"
PKGDIR="/usr/portage/packages"
PORTAGE_CONFIGROOT="/"
PORTAGE_RSYNC_OPTS="--recursive --links --safe-links --perms --times --compress --force --whole-file --delete --stats --timeout=180 --exclude=/distfiles --exclude=/local --exclude=/packages"
PORTAGE_TMPDIR="/var/tmp"
PORTDIR="/usr/portage"
SYNC="rsync://localhost/gentoo-portage"
USE="X acl amd64 berkdb bzip2 cli cracklib crypt cups dri fortran gcj gdbm gpm iconv ipv6 isdnlog mmx mudflap multilib ncurses nls nptl nptlonly objc openmp pam pcre perl pppd python readline reflection session spl sse sse2 ssl sysfs tcpd unicode xorg zlib" ALSA_CARDS="ali5451 als4000 atiixp atiixp-modem bt87x ca0106 cmipci emu10k1x ens1370 ens1371 es1938 es1968 fm801 hda-intel intel8x0 intel8x0m maestro3 trident usb-audio via82xx via82xx-modem ymfpci" ALSA_PCM_PLUGINS="adpcm alaw asym copy dmix dshare dsnoop empty extplug file hooks iec958 ioplug ladspa lfloat linear meter mmap_emul mulaw multi null plug rate route share shm softvol" APACHE2_MODULES="actions alias auth_basic authn_alias authn_anon authn_dbm authn_default authn_file authz_dbm authz_default authz_groupfile authz_host authz_owner authz_user autoindex cache dav dav_fs dav_lock deflate dir disk_cache env expires ext_filter file_cache filter headers include info log_config logio mem_cache mime mime_magic negotiation rewrite setenvif speling status unique_id userdir usertrack vhost_alias" ELIBC="glibc" INPUT_DEVICES="keyboard mouse evdev" KERNEL="linux" LCD_DEVICES="bayrad cfontz cfontz633 glk hd44780 lb216 lcdm001 mtxorb ncurses text" USERLAND="GNU" VIDEO_CARDS="vga"
Unset:  CPPFLAGS, CTARGET, EMERGE_DEFAULT_OPTS, FFLAGS, INSTALL_MASK, LANG, LC_ALL, LINGUAS, PORTAGE_COMPRESS, PORTAGE_COMPRESS_FLAGS, PORTAGE_RSYNC_EXTRA_OPTS, PORTDIR_OVERLAY
Comment 1 Pacho Ramos gentoo-dev 2010-03-19 09:58:18 UTC
+*gnome-vfs-2.24.2-r1 (19 Mar 2010)
+
+  19 Mar 2010; Pacho Ramos <pacho@gentoo.org> +gnome-vfs-2.24.2-r1.ebuild,
+  +files/gnome-vfs-2.24.2-symlink-crash.patch:
+  Fix crash if a null symlink is got (see bug #309621, thanks to Jacek for
+  reporting ubuntu/debian patch) and fix tests unsetting XAUTHORITY (see bug
+  #285706, thanks to Patrick for reporting)
Comment 2 Pacho Ramos gentoo-dev 2010-05-08 08:46:40 UTC
Still alive :-S
Comment 3 Pacho Ramos gentoo-dev 2010-05-08 08:47:27 UTC
Created attachment 230775 [details]
build.log
Comment 4 Pacho Ramos gentoo-dev 2010-05-08 09:00:42 UTC
It also fails outside portage, reported upstream then:
https://bugzilla.gnome.org/show_bug.cgi?id=618089
Comment 5 Gilles Dartiguelongue gentoo-dev 2010-10-02 11:57:18 UTC
+*gnome-vfs-2.24.4 (02 Oct 2010)
+
+  02 Oct 2010; Gilles Dartiguelongue <eva@gentoo.org>
+  files/gnome-vfs-2.24.0-uuid-mount.patch, +gnome-vfs-2.24.4.ebuild,
+  +files/gnome-vfs-2.24.4-build-tests-asneeded.patch,
+  +files/gnome-vfs-2.24.4-disable-test-async-cancel.patch,
+  +files/gnome-vfs-2.24.4-home_dir_fakeroot.patch:
+  Version bump. Do not build tests if not needed, bug #226221. Disable
+  broken test, bug #285706. Do not install *.la files for gnome-vfs modules.
+

Test disable, unlikely to be fixed unless someone provides a patch. In the mean time, closing upstream.