Gentoo Websites Logo
Go to: Gentoo Home Documentation Forums Lists Bugs Planet Store Wiki Get Gentoo!
Bug 270601 - kde-base/kopete-3.5.10-r2 compile failed due to glibc-2.10
Summary: kde-base/kopete-3.5.10-r2 compile failed due to glibc-2.10
Alias: None
Product: Gentoo Linux
Classification: Unclassified
Component: Current packages (show other bugs)
Hardware: AMD64 Linux
: High normal (vote)
Assignee: Gentoo KDE team
Depends on:
Blocks: kde-3.5.10 glibc-2.10
  Show dependency tree
Reported: 2009-05-20 17:15 UTC by Oschtan
Modified: 2009-06-04 18:20 UTC (History)
2 users (show)

See Also:
Package list:
Runtime testing required: ---

patch (kopete-3.5.10-r4.diff,934 bytes, patch)
2009-06-02 21:58 UTC, Oschtan
Details | Diff

Note You need to log in before you can comment on or make changes to this bug.
Description Oschtan 2009-05-20 17:15:08 UTC
/bin/sh ../../../../libtool --silent --tag=CXX --mode=compile x86_64-pc-linux-gnu-g++ -DHAVE_CONFIG_H -I. -I. -I../../../.. -I../../../../kopete/protocols/gadu/libgadu  -I../../../../kopete/libkopete -I/usr/kde/3.5/include -I/usr/qt/3/include -I.  -DQT_THREAD_SUPPORT  -D_REENTRANT -D_LARGE_FILES=1  -Wno-long-long -Wundef -ansi -D_XOPEN_SOURCE=500 -D_BSD_SOURCE -Wcast-align -Wchar-subscripts -Wall -W -Wpointer-arith -DNDEBUG -DNO_DEBUG -O2 -O2 -pipe -march=amdfam10 -mtune=amdfam10 -Wformat-security -Wmissing-format-attribute -Wno-non-virtual-dtor -fno-exceptions -fno-check-new -fno-common -fvisibility=hidden -fvisibility-inlines-hidden -DQT_CLEAN_NAMESPACE -DQT_NO_ASCII_CAST -DQT_NO_STL -DQT_NO_COMPAT -DQT_NO_TRANSLATION  -c -o locationrightstask.lo locationrightstask.cpp
rtf.ll: In function 'int rtflex()':
rtf.ll:57: warning: ignoring return value of 'size_t fwrite(const void*, size_t, size_t, FILE*)', declared with attribute warn_unused_result
rtf.ll: In member function 'void RTF2HTML::PrintUnquoted(const char*, ...)':
rtf.ll:313: warning: function might be possible candidate for 'gnu_printf' format attribute
rtf.ll: In member function 'void Level::setText(const char*)':
rtf.ll:571: error: invalid conversion from 'const char*' to 'char*'
make[5]: *** [rtf.lo] Error 1
make[5]: *** Waiting for unfinished jobs....
make[5]: Leaving directory `/var/tmp/portage/kde-base/kopete-3.5.10-r2/work/kopete-3.5.10/kopete/protocols/oscar/liboscar'
make[4]: *** [all-recursive] Error 1
make[4]: Leaving directory `/var/tmp/portage/kde-base/kopete-3.5.10-r2/work/kopete-3.5.10/kopete/protocols/oscar'
make[3]: *** [all-recursive] Error 1
make[3]: Leaving directory `/var/tmp/portage/kde-base/kopete-3.5.10-r2/work/kopete-3.5.10/kopete/protocols'
make[2]: *** [all-recursive] Error 1
make[2]: Leaving directory `/var/tmp/portage/kde-base/kopete-3.5.10-r2/work/kopete-3.5.10/kopete'
make[1]: *** [all-recursive] Error 1
make[1]: Leaving directory `/var/tmp/portage/kde-base/kopete-3.5.10-r2/work/kopete-3.5.10'
make: *** [all] Error 2
 * ERROR: kde-base/kopete-3.5.10-r2 failed.

Reproducible: Always

Steps to Reproduce:

Portage 2.2_rc33 (default/linux/amd64/2008.0, gcc-4.4.0, glibc-2.10.1-r0, 2.6.29-gentoo-r4 x86_64)
System uname: Linux-2.6.29-gentoo-r4-x86_64-AMD_Phenom-tm-_8450_Triple-Core_Processor-with-gentoo-2.0.0
Timestamp of tree: Wed, 20 May 2009 07:45:01 +0000
ccache version 2.4 [enabled]
app-shells/bash:     4.0_p24
dev-java/java-config: 1.3.7-r1, 2.1.7
dev-lang/python:     2.6.2
dev-python/pycrypto: 2.0.1-r8
dev-util/ccache:     2.4-r8
dev-util/cmake:      2.6.4
sys-apps/baselayout: 2.0.0
sys-apps/openrc:     0.4.3-r2
sys-apps/sandbox:    1.9
sys-devel/autoconf:  2.13, 2.63-r1
sys-devel/automake:  1.5, 1.6.3, 1.7.9-r1, 1.8.5-r3, 1.9.6-r2, 1.10.2
sys-devel/binutils:  2.19.1-r1
sys-devel/gcc-config: 1.4.1
sys-devel/libtool:   2.2.6a
virtual/os-headers:  2.6.29
ACCEPT_KEYWORDS="amd64 ~amd64"
CFLAGS="-O2 -pipe -march=amdfam10 -mtune=amdfam10"
CONFIG_PROTECT="/etc /usr/kde/3.5/env /usr/kde/3.5/share/config /usr/kde/3.5/shutdown /usr/share/config /var/lib/hsqldb"
CONFIG_PROTECT_MASK="/etc/ca-certificates.conf /etc/env.d /etc/env.d/java/ /etc/fonts/fonts.conf /etc/gconf /etc/gentoo-release /etc/php/apache2-php5/ext-active/ /etc/php/cgi-php5/ext-active/ /etc/php/cli-php5/ext-active/ /etc/revdep-rebuild /etc/sandbox.d /etc/splash /etc/terminfo /etc/udev/rules.d"
CXXFLAGS="-O2 -pipe -march=amdfam10 -mtune=amdfam10"
FEATURES="buildpkg ccache collision-protect distlocks fixpackages metadata-transfer parallel-fetch preserve-libs protect-owned sandbox sets sfperms strict unmerge-orphans userfetch"
PORTAGE_RSYNC_OPTS="--recursive --links --safe-links --perms --times --compress --force --whole-file --delete --stats --timeout=180 --exclude=/distfiles --exclude=/local --exclude=/packages"
USE="3dnow 3dnowext 7zip X a52 aac aalib acl acpi additions alsa amd64 amr amrnb amrwb ao apm arts audiofile avahi bdf berkdb bindist branding bzip2 cairo cdparanoia cgi cjk clamav cleartype cli consolekit cracklib crypt dbus djvu dri dv dvd dvdr emerald enca encode exif faac faad fastcgi fbcondecor ffmpeg fontconfig fortran ftp fuse gd gecko gif gimp git glitz gphoto2 gpm gtk hal hddtemp hdri iconv imagemagick imlib isdnlog jabber java jbig jpeg jpeg2k kde kdehiddenvisibility lame latin1 lcms lib32 libnotify lm_sensors lzma mad midi mikmod mjpeg mmx mmxext mng motif mp2 mp3 mp4 mpeg mplayer mudflap multilib multitarget mysql ncurses nls npp nptl nptlonly nsplugin oav objc objc++ objc-gc ogg openexr opengl openmp oscar pam pcre pdf perl php png povray pppd python qt3 quicktime rar rcc readline reflection rtc samba sdl sensord session sndfile source spell spl sqlite sqlite3 srt sse sse2 ssl startup-notification subversion suid svg symlink sysfs syslog tcpd templates theora tidy tiff truetype unicode unsupported usb utempter vcd vorbis webdav-neon wmf x264 xattr xcb xcomposite xine xml xorg xpm xscreensaver xulrunner xvid yv12 zip zlib" ALSA_CARDS="hda-intel" ALSA_PCM_PLUGINS="adpcm alaw asym copy dmix dshare dsnoop empty extplug file hooks iec958 ioplug ladspa lfloat linear meter mmap_emul mulaw multi null plug rate route share shm softvol" CAMERAS="adc65 agfa_cl20 aox barbie canon casio_qv clicksmart310 digigr8 digita dimagev dimera3500 directory enigma13 fuji gsmart300 hp215 iclick jamcam jd11 kodak_dc120 kodak_dc210 kodak_dc240 kodak_dc3200 kodak_ez200 konica konica_qm150 largan lg_gsm mars mustek panasonic_coolshot panasonic_dc1000 panasonic_dc1580 panasonic_l859 pccam300 pccam600 polaroid_pdc320 polaroid_pdc640 polaroid_pdc700 ptp2 ricoh ricoh_g3 samsung sierra sipix_blink sipix_blink2 sipix_web2 smal sonix sony_dscf1 sony_dscf55 soundvision spca50x sq905 stv0674 stv0680 sx330z template toshiba_pdrm11" ELIBC="glibc" INPUT_DEVICES="evdev" KERNEL="linux" LCD_DEVICES="bayrad cfontz cfontz633 glk hd44780 lb216 lcdm001 mtxorb ncurses text" LINGUAS="ru" USERLAND="GNU" VIDEO_CARDS="nvidia"
Comment 1 Oschtan 2009-05-21 14:37:49 UTC
Also, 3.5.10
Comment 2 Oschtan 2009-05-24 15:24:57 UTC
Hm. This bug in future - eternal. Go to pidgin..

Comment 3 Oschtan 2009-05-29 08:48:04 UTC
Also, 3.5.10-r4
Comment 4 Theo Chatzimichos (RETIRED) archtester gentoo-dev Security 2009-05-29 22:06:36 UTC
i need a patch for this
Comment 5 Theo Chatzimichos (RETIRED) archtester gentoo-dev Security 2009-06-02 12:25:25 UTC
I'd prefer this open in case a patch is found (or created by someone :) )
Comment 6 Oschtan 2009-06-02 21:58:51 UTC
Created attachment 193330 [details, diff]
Comment 7 Oschtan 2009-06-03 08:26:56 UTC
Hm. Fixed?
Comment 8 Theo Chatzimichos (RETIRED) archtester gentoo-dev Security 2009-06-04 18:20:17 UTC
yeah, thanks :)