Gentoo Websites Logo
Go to: Gentoo Home Documentation Forums Lists Bugs Planet Store Wiki Get Gentoo!
Bug 234624 - kde-base/kdelibs-3.5.9-r4 fails to compile after setting USE Flag "spell"
Summary: kde-base/kdelibs-3.5.9-r4 fails to compile after setting USE Flag "spell"
Status: RESOLVED FIXED
Alias: None
Product: Gentoo Linux
Classification: Unclassified
Component: New packages (show other bugs)
Hardware: x86 Linux
: High normal (vote)
Assignee: Gentoo KDE team
URL:
Whiteboard:
Keywords:
Depends on:
Blocks: kde-3.5.10
  Show dependency tree
 
Reported: 2008-08-13 12:47 UTC by Miro Bogner
Modified: 2009-05-27 22:44 UTC (History)
1 user (show)

See Also:
Package list:
Runtime testing required: ---


Attachments

Note You need to log in before you can comment on or make changes to this bug.
Description Miro Bogner 2008-08-13 12:47:00 UTC
emerge kdebase/kdelibs-3.5.9-r4 fail after setting USE Flag "spell"

Reproducible: Always

Steps to Reproduce:
1.emerge world -uDN
2.
3.

Actual Results:  
/bin/sh ../libtool --silent --tag=CXX --mode=link i686-pc-linux-gnu-g++  -Wno-long-long -Wundef -ansi -D_XOPEN_SOURCE=500 -D_BSD_SOURCE -Wcast-align -Wchar-subscripts -Wall -W -Wpointer-arith -DNDEBUG -DNO_DEBUG -O2 -march=pentium-m -O2 -pipe -fomit-frame-pointer -Wformat-security -Wmissing-format-attribute -Wno-non-virtual-dtor -fno-exceptions -fno-check-new -fno-common  -DQT_CLEAN_NAMESPACE -DQT_NO_ASCII_CAST -DQT_NO_STL -DQT_NO_COMPAT -DQT_NO_TRANSLATION   -Wl,-O1 -Wl,-z,now -o libkio.la -rpath /usr/kde/3.5/lib -version-info 6:0:2 -no-undefined -Wl,--no-undefined -Wl,--allow-shlib-undefined -L/usr/kde/3.5/lib -L/usr/qt/3/lib      dummy.lo kssl/libkssl.la kio/libkiocore.la kio/libksycoca.la bookmarks/libkbookmarks.la kfile/libkfile.la ../kdeui/libkdeui.la ../kdesu/libkdesu.la ../kwallet/client/libkwalletclient.la -lz   -lacl -lattr
kio/.libs/libkiocore.a: member kio/.libs/libkiocore.a(observer_stub.o) in archive is not an object
collect2: ld returned 1 exit status
make[3]: *** [libkio.la] Error 1
make[3]: Leaving directory `/var/tmp/portage/kde-base/kdelibs-3.5.9-r4/work/kdelibs-3.5.9/kio'
make[2]: *** [all-recursive] Error 1
make[2]: Leaving directory `/var/tmp/portage/kde-base/kdelibs-3.5.9-r4/work/kdelibs-3.5.9/kio'
make[1]: *** [all-recursive] Error 1
make[1]: Leaving directory `/var/tmp/portage/kde-base/kdelibs-3.5.9-r4/work/kdelibs-3.5.9'
make: *** [all] Error 2
 *
 * ERROR: kde-base/kdelibs-3.5.9-r4 failed.
 * Call stack:
 *               ebuild.sh, line   49:  Called src_compile
 *             environment, line 4079:  Called kde_src_compile
 *             environment, line 2879:  Called kde_src_compile 'src_compile'
 *             environment, line 2999:  Called kde_src_compile 'src_compile' 'all' 'myconf'
 *             environment, line 2995:  Called die
 * The specific snippet of code:
 *                   emake || die "died running emake, $FUNCNAME:make"
 *  The die message:
 *   died running emake, kde_src_compile:make
 *
 * If you need support, post the topmost build error, and the call stack if relevant.
 * A complete build log is located at '/var/tmp/portage/kde-base/kdelibs-3.5.9-r4/temp/build.log'.
 * The ebuild environment file is located at '/var/tmp/portage/kde-base/kdelibs-3.5.9-r4/temp/environment'.
 *

 * Messages for package kde-base/kdelibs-3.5.9-r4:

 * On some setups, which rely on the correct update of utmp records, not using
 * utempter might not update them correctly. If you experience unexpected
 * behaviour, try to rebuild kde-base/kdelibs with utempter use-flag enabled.
 *
 * ERROR: kde-base/kdelibs-3.5.9-r4 failed.
 * Call stack:
 *               ebuild.sh, line   49:  Called src_compile
 *             environment, line 4079:  Called kde_src_compile
 *             environment, line 2879:  Called kde_src_compile 'src_compile'
 *             environment, line 2999:  Called kde_src_compile 'src_compile' 'all' 'myconf'
 *             environment, line 2995:  Called die
 * The specific snippet of code:
 *                   emake || die "died running emake, $FUNCNAME:make"
 *  The die message:
 *   died running emake, kde_src_compile:make
 *
 * If you need support, post the topmost build error, and the call stack if relevant.
 * A complete build log is located at '/var/tmp/portage/kde-base/kdelibs-3.5.9-r4/temp/build.log'.
 * The ebuild environment file is located at '/var/tmp/portage/kde-base/kdelibs-3.5.9-r4/temp/environment'.

Expected Results:  
compile and install as needed

emerge --info:

Portage 2.1.4.4 (default/linux/x86/2008.0, gcc-4.1.2, glibc-2.6.1-r0, 2.6.24-tuxonice-r9 i686)
=================================================================
System uname: 2.6.24-tuxonice-r9 i686 Intel(R) Pentium(R) M processor 1400MHz
Timestamp of tree: Tue, 12 Aug 2008 09:00:01 +0000
ccache version 2.4 [enabled]
app-shells/bash:     3.2_p33
dev-java/java-config: 1.3.7, 2.1.6
dev-lang/python:     2.5.2-r7
dev-util/ccache:     2.4-r7
sys-apps/baselayout: 1.12.11.1
sys-apps/sandbox:    1.2.18.1-r2
sys-devel/autoconf:  2.13, 2.61-r2
sys-devel/automake:  1.4_p6, 1.7.9-r1, 1.8.5-r3, 1.9.6-r2, 1.10.1
sys-devel/binutils:  2.18-r3
sys-devel/gcc-config: 1.4.0-r4
sys-devel/libtool:   1.5.26
virtual/os-headers:  2.6.23-r3
ACCEPT_KEYWORDS="x86"
CBUILD="i686-pc-linux-gnu"
CFLAGS="-march=pentium-m -O2 -pipe -fomit-frame-pointer"
CHOST="i686-pc-linux-gnu"
CONFIG_PROTECT=""
CONFIG_PROTECT_MASK="/etc/env.d /etc/env.d/java/ /etc/fonts/fonts.conf /etc/gconf /etc/revdep-rebuild /etc/terminfo /etc/texmf/web2c /etc/udev/rules.d"
CXXFLAGS="-march=pentium-m -O2 -pipe -fomit-frame-pointer"
DISTDIR="/usr/portage/distfiles"
FEATURES="ccache distlocks metadata-transfer sandbox sfperms strict unmerge-orphans userfetch"
GENTOO_MIRRORS="ftp://de-mirror.org/distro/gentoo/ "
LANG="en_US.UTF-8"
LDFLAGS="-Wl,-O1 -Wl,-z,now"
LINGUAS="en de"
MAKEOPTS="-j2"
PKGDIR="/usr/portage/packages"
PORTAGE_RSYNC_OPTS="--recursive --links --safe-links --perms --times --compress --force --whole-file --delete --stats --timeout=180 --exclude=/distfiles --exclude=/local --exclude=/packages"
PORTAGE_TMPDIR="/var/tmp"
PORTDIR="/usr/portage"
PORTDIR_OVERLAY="/usr/portage/local/layman/zugaina /usr/portage/local/layman/enlightenment /usr/portage/local"
SYNC="rsync://rsync.gentoo.org/gentoo-portage"
USE="X a52 aac accessibility acl acpi additions aim alisp alsa berkdb bittorrent bzip2 cddb cdr cli cpudetection cracklib crypt css cups cursors custom-optimization cvs dbus divx dri dvd dvdread encode ffmpeg fortran ftp gdbm gimp gmail gnuplot gpm gtk hal iconv icq id3tag ipv6 irda isdnlog java javacomm javascript jfs jpeg kde lame laptop latex lirc midi mmx mmxext mozilla mp3 mp4 mpeg mpeg2 mplayer msn mtp mudflap ncurses nls nptl nptlonly nsplugin ntfs ogg opengl openmp openssl opensslcrypt pam pcre pdf pentium perl pidgin png pppd python qt-static qt4 quicktime raw readline reflection scrobbler sdl session spell spl sse sse2 ssl subtitles svg sysfs tcpd tetex threads unicode usb wifi win32codecs wma x86 xcomposite xine xml xorg xpm xulrunner xvid zlib" ALSA_CARDS="intel8x0 intel8x0m" ALSA_PCM_PLUGINS="adpcm alaw asym copy dmix dshare dsnoop empty extplug file hooks iec958 ioplug ladspa lfloat linear meter mmap_emul mulaw multi null plug rate route share shm softvol" APACHE2_MODULES="actions alias auth_basic authn_alias authn_anon authn_dbm authn_default authn_file authz_dbm authz_default authz_groupfile authz_host authz_owner authz_user autoindex cache dav dav_fs dav_lock deflate dir disk_cache env expires ext_filter file_cache filter headers include info log_config logio mem_cache mime mime_magic negotiation rewrite setenvif speling status unique_id userdir usertrack vhost_alias" ELIBC="glibc" INPUT_DEVICES="evdev keyboard mouse synaptics" KERNEL="linux" LCD_DEVICES="bayrad cfontz cfontz633 glk hd44780 lb216 lcdm001 mtxorb ncurses text" LINGUAS="en de" USERLAND="GNU" VIDEO_CARDS="radeon"
Unset:  CPPFLAGS, CTARGET, EMERGE_DEFAULT_OPTS, INSTALL_MASK, LC_ALL, PORTAGE_COMPRESS, PORTAGE_COMPRESS_FLAGS, PORTAGE_RSYNC_EXTRA_OPTS

I also tried to clean ccache (ccache -C) und deleted /var/tmp/portage/kde-base/kdelibs-3.5.9-r4 before running emerge, didn't do any difference..
Comment 1 Carsten Lohrke (RETIRED) gentoo-dev 2008-09-14 22:34:09 UTC
Please clean out /var/tmp/portage and retry without ccache.
Comment 2 Leander 2008-10-06 20:21:52 UTC
I have the same problem, I can't compile this one either. 
When I do a revdep-rebuild it wants to rebuild kdelibs, but it won't compile.
I get the same error. Please tell me how to make it work. I tried to clear the cache folder, but didn't help. 
Comment 3 Theo Chatzimichos (RETIRED) archtester Gentoo Infrastructure gentoo-dev Security 2009-05-27 22:44:06 UTC
Couldn't reproduce with 3.5.10, please upgrade