Gentoo Websites Logo
Go to: Gentoo Home Documentation Forums Lists Bugs Planet Store Wiki Get Gentoo!
Bug 146034 - emerge gcc 4.1.1 fails
Summary: emerge gcc 4.1.1 fails
Status: RESOLVED DUPLICATE of bug 20600
Alias: None
Product: Gentoo Linux
Classification: Unclassified
Component: [OLD] Core system (show other bugs)
Hardware: x86 Linux
: High major (vote)
Assignee: Gentoo Linux bug wranglers
Depends on:
Reported: 2006-09-02 12:48 UTC by Narada Sage
Modified: 2006-09-02 14:17 UTC (History)
0 users

See Also:
Package list:
Runtime testing required: ---


Note You need to log in before you can comment on or make changes to this bug.
Description Narada Sage 2006-09-02 12:48:52 UTC
dhruba ~ # emerge --info
Portage 2.1.1_rc1-r2 (default-linux/x86/2006.0, gcc-3.4.6, glibc-2.3.6-r4, 2.6.17-rc2-linode19 i686)
System uname: 2.6.17-rc2-linode19 i686 UML
Gentoo Base System version 1.12.4
Last Sync: Sat, 02 Sep 2006 06:29:01 +0000
ccache version 2.3 [enabled]
app-admin/eselect-compiler: [Not Present]
dev-lang/python:     2.2.3-r1, 2.3.5-r2, 2.4.3-r1
dev-python/pycrypto: 2.0.1-r5
dev-util/ccache:     2.3
dev-util/confcache:  [Not Present]
sys-apps/sandbox:    1.2.17
sys-devel/autoconf:  2.13, 2.59-r7
sys-devel/automake:  1.4_p6, 1.5, 1.6.3, 1.7.9-r1, 1.8.5-r3, 1.9.6-r2
sys-devel/binutils:  2.16.1-r3
sys-devel/gcc-config: 1.3.13-r3
sys-devel/libtool:   1.5.22
virtual/os-headers:  2.4.19-r1, 2.6.11-r2
CFLAGS="-O2 -mtune=i686 -pipe"
CONFIG_PROTECT="/etc /usr/share/texmf/dvipdfm/config/ /usr/share/texmf/dvips/config/ /usr/share/texmf/tex/generic/config/ /usr/share/texmf/tex/platex/config/ /usr/share/texmf/xdvi/"
CONFIG_PROTECT_MASK="/etc/env.d /etc/env.d/java/ /etc/gconf /etc/java-config/vms/ /etc/revdep-rebuild /etc/terminfo"
CXXFLAGS="-O2 -mtune=i686 -pipe"
FEATURES="autoconfig buildpkg ccache distlocks metadata-transfer sandbox sfperms strict"
PORTAGE_RSYNC_OPTS="--recursive --links --safe-links --perms --times --compress --force --whole-file --delete --delete-after --stats --timeout=180 --exclude='/distfiles' --exclude='/local' --exclude='/packages'"
PORTDIR_OVERLAY="/usr/local/gentoo-php-overlay/testing /usr/local/gentoo-php-overlay/experimental"
USE="x86 apache2 bash-completion bzip2 calendar ccache crypt ctype curl elibc_glibc enscript exif gd gif gs iconv imagemagick imap input_devices_evdev input_devices_keyboard input_devices_mouse java java-external jpeg kernel_linux maildir memlimit mime mmap ncurses objc pam pcre pdf pdflib pdo-external perl php png pop postfix python readline sharedext silvercity simplexml slang soap sockets spell spl sqlite sqlite3 sse sse2 ssl svg tcpd tetex tidy tiff tokenizer unicode userland_GNU utf8 vhosts video_cards_apm video_cards_ark video_cards_ati video_cards_chips video_cards_cirrus video_cards_cyrix video_cards_dummy video_cards_fbdev video_cards_glint video_cards_i128 video_cards_i740 video_cards_i810 video_cards_imstt video_cards_mga video_cards_neomagic video_cards_nsc video_cards_nv video_cards_rendition video_cards_s3 video_cards_s3virge video_cards_savage video_cards_siliconmotion video_cards_sis video_cards_sisusb video_cards_tdfx video_cards_tga video_cards_trident video_cards_tseng video_cards_v4l video_cards_vesa video_cards_vga video_cards_via video_cards_vmware video_cards_voodoo wddx xml xml2 xmlreader xmlrpc xsl xslt zip zlib"


 * Applying Gentoo patches ...
 *   00_all_gcc-trampolinewarn.patch ...
 * Failed Patch: 00_all_gcc-trampolinewarn.patch !
 *  ( /var/tmp/portage/gcc-4.1.1/work/patch/00_all_gcc-trampolinewarn.patch )
 * Include in your bugreport the contents of:
 *   /var/tmp/portage/gcc-4.1.1/temp/00_all_gcc-trampolinewarn.patch-20691.out

!!! ERROR: sys-devel/gcc-4.1.1 failed.
Call stack:, line 1543:   Called dyn_unpack, line 709:   Called src_unpack
  gcc-4.1.1.ebuild, line 51:   Called gcc_src_unpack
  toolchain.eclass, line 1015:   Called epatch '/var/tmp/portage/gcc-4.1.1/work/patch'
  eutils.eclass, line 341:   Called die

!!! Failed Patch: 00_all_gcc-trampolinewarn.patch!
!!! If you need support, post the topmost build error, and the call stack if relevant.
Comment 1 Polarina 2006-09-02 12:49:56 UTC
 * Include in your bugreport the contents of:
 *   /var/tmp/portage/gcc-4.1.1/temp/00_all_gcc-trampolinewarn.patch-20691.out

So, where is it?
Comment 2 Narada Sage 2006-09-02 12:52:34 UTC
I will upload it shortly.
Comment 3 Narada Sage 2006-09-02 12:54:57 UTC
Okay.  I am quite puzzled.  Not only was that file not there but the next time I tried the emerge it got past the trampoline patch which was applied successfully.  Please feel free to close and I'll refile if I get further problems.
Comment 4 Patrick Lauer gentoo-dev 2006-09-02 13:04:00 UTC
closing, reopen as needed
Comment 5 Narada Sage 2006-09-02 14:04:40 UTC
Okay I'm getting a new failure therefore reopening.  Error message below.

/bin/sh /var/tmp/portage/gcc-4.1.1/work/gcc-4.1.1/gcc/ tm.h
gawk -f /var/tmp/portage/gcc-4.1.1/work/gcc-4.1.1/gcc/opt-gather.awk /var/tmp/portage/gcc-4.1.1/work/gcc-4.1.1/gcc/c.opt /var/tmp/portage/gcc-4.1.1/work/gcc-4.1.1/gcc/common.opt /var/tmp/portage/gcc-4.1.1/work/gcc-4.1.1/gcc/config/i386/i386.opt > tmp-optionlist
/bin/sh /var/tmp/portage/gcc-4.1.1/work/gcc-4.1.1/gcc/../move-if-change tmp-optionlist optionlist
echo timestamp > s-options
gawk -f /var/tmp/portage/gcc-4.1.1/work/gcc-4.1.1/gcc/opt-functions.awk -f /var/tmp/portage/gcc-4.1.1/work/gcc-4.1.1/gcc/opth-gen.awk \
       < optionlist > tmp-options.h
/bin/sh /var/tmp/portage/gcc-4.1.1/work/gcc-4.1.1/gcc/../move-if-change tmp-options.h options.h
echo timestamp > s-options-h
HEADERS="auto-host.h ansidecl.h" DEFINES="" \
/bin/sh /var/tmp/portage/gcc-4.1.1/work/gcc-4.1.1/gcc/ bconfig.h
gcc -c   -O -DENABLE_CHECKING -DENABLE_ASSERT_CHECKING -DIN_GCC   -W -Wall -Wwrite-strings -Wstrict-prototypes -Wmissing-prototypes -Wold-style-definition -Wmissing-format-attribute    -DHAVE_CONFIG_H -DGENERATOR_FILE -I. -Ibuild -I/var/tmp/portage/gcc-4.1.1/work/gcc-4.1.1/gcc -I/var/tmp/portage/gcc-4.1.1/work/gcc-4.1.1/gcc/build -I/var/tmp/portage/gcc-4.1.1/work/gcc-4.1.1/gcc/../include -I/var/tmp/portage/gcc-4.1.1/work/gcc-4.1.1/gcc/../libcpp/include     -o build/genmodes.o /var/tmp/portage/gcc-4.1.1/work/gcc-4.1.1/gcc/genmodes.c
gcc -c   -O -DENABLE_CHECKING -DENABLE_ASSERT_CHECKING -DIN_GCC   -W -Wall -Wwrite-strings -Wstrict-prototypes -Wmissing-prototypes -Wold-style-definition -Wmissing-format-attribute    -DHAVE_CONFIG_H -DGENERATOR_FILE -I. -Ibuild -I/var/tmp/portage/gcc-4.1.1/work/gcc-4.1.1/gcc -I/var/tmp/portage/gcc-4.1.1/work/gcc-4.1.1/gcc/build -I/var/tmp/portage/gcc-4.1.1/work/gcc-4.1.1/gcc/../include -I/var/tmp/portage/gcc-4.1.1/work/gcc-4.1.1/gcc/../libcpp/include     -o build/errors.o /var/tmp/portage/gcc-4.1.1/work/gcc-4.1.1/gcc/errors.c
make[2]: *** [build/errors.o] Error 255
make[2]: Leaving directory `/var/tmp/portage/gcc-4.1.1/work/build/gcc'
make[1]: *** [stage1_build] Error 2
make[1]: Leaving directory `/var/tmp/portage/gcc-4.1.1/work/build/gcc'
make: *** [profiledbootstrap] Error 2

!!! ERROR: sys-devel/gcc-4.1.1 failed.
Call stack:, line 1543:   Called dyn_compile, line 938:   Called src_compile, line 1252:   Called toolchain_src_compile
  toolchain.eclass, line 24:   Called gcc_src_compile
  toolchain.eclass, line 1528:   Called gcc_do_make
  toolchain.eclass, line 1402:   Called die

!!! emake failed with profiledbootstrap
!!! If you need support, post the topmost build error, and the call stack if relevant.
Comment 6 Jakub Moc (RETIRED) gentoo-dev 2006-09-02 14:17:14 UTC
(In reply to comment #5)
> Okay I'm getting a new failure therefore reopening.  Error message below.

This is not a dumpspace for random failures.

*** This bug has been marked as a duplicate of 20600 ***