Gentoo Websites Logo
Go to: Gentoo Home Documentation Forums Lists Bugs Planet Store Wiki Get Gentoo!
Votes Bug # Summary
Gentoo Hosted Projects (bug list)
1 571962 sys-apps/openrc-0.20: segfault on ~amd64 (Show Votes)
1 vote used out of 5 allowed.

Gentoo Linux (bug list)
1 415913 games-sports/speed-dreams new version 2.0 available - please update (Show Votes)
1 443898 >=net-ftp/vsftpd-3.0.0: 500 OOPS: priv_sock_get_cmd with seccomp_sandbox=YES (default) (Show Votes)
1 453084 net-wireless/wpa_supplicant-2.0 version bump (Show Votes)
1 502430 media-libs/mesa-9.2.5-r1 with sys-devel/llvm-3.4 ? - /usr/lib64/libLLVMSupport.a(Process.o): In function `llvm::sys::Process::FileDescriptorHasColors(int)': Process.cpp:(.text+0x5f7): undefined reference to `setupterm' (Show Votes)
1 531360 sys-power/cpupower - add systemd service unit (Show Votes)
1 533918 sys-apps/linux-misc-apps-3.18 - make: *** No rule to make target '../../../../turbostat'. Stop. (Show Votes)
1 544318 net-misc/tigervnc-1.6.0 version bump (Show Votes)
1 546786 media-gfx/freecad: freecad-0.15.4671 has been released (Show Votes)
1 564918 www-cilent/firefox-42[system-cairo]: Crash when opening a new tab. (Show Votes)
1 568066 media-gfx/simple-scan-3.18.2 - error: Package `gusb' not found (Show Votes)
1 583774 sys-apps/systemd-230: version bump (Show Votes)
1 586114 >=app-emulation/wine-1.9.10: USE=staging requires different gecko version (Show Votes)
1 587066 =sys-process/criu-2.3 does not build with =dev-libs/protobuf-3.0.0_beta3: No rule to make target 'images/stats.pb-c.c', needed by 'images/stats.o'. Stop. (Show Votes)
1 590596 app-office/libreoffice-5.2.0.4 version bump (Show Votes)
1 595996 app-office/texstudio-2.11.2 version bump (Show Votes)
1 598170 net-firewall/nftables-0.6-r4 - failure to build (Show Votes)
1 621042 net-misc/clipgrab-3.6.5 : !!! Couldn't download 'clipgrab-3.6.5.tar.bz2'. Aborting. (Show Votes)
1 626130 app-office/texstudio-2.12.6 version bump (Show Votes)
1 627960 net-misc/curl-7.55.1 with glibc-2.25-r3: configure: error: Threaded resolver enabled but no thread library found (Show Votes)
1 631284 www-client/firefox - Subpixel font rendering broken with >=media-libs/freetype-2.8.1 (Show Votes)
1 634620 [gnome-next overlay] sys-libs/binutils-libs-2.29.1-r1: compilation of gnome-extra/evolution-data-server-3.27.1 and other packages fails with undefined symbol: _hex_value when LTO is used (Show Votes)
1 637270 =net-fs/autofs-5.1.3 with >=sys-libs/glibc-2.26 - configure: error: required program RPCGEN not found (Show Votes)
1 638302 sys-apps/miscfiles-1.5-r2 with USE=minimal fails to merge (Show Votes)
1 641384 media-video/mpv-0.27.0 fails to compile vs. x11-libs/libva-2.0.0 (Show Votes)
1 653784 app-emulation/wine-vanilla-3.6 version bump (Show Votes)
1 666470 app-office/texmacs version bump request (Show Votes)
1 683892 dev-libs/protobuf-3.7.1 with ld.gold - ./.libs/libprotoc.so: error: undefined reference to 'scc_info_FileDescriptorProto_google_2fprotobuf_2fdescriptor_2eproto' (Show Votes)
1 688054 dev-texlive/texlive-langczechslovak-2019: ! I can't find file `hyph-en-gb'. (and more) (Show Votes)
1 692416 sys-apps/tcp-wrappers-7.6.28[-ipv6]: scaffold.c:30:14: error: conflicting types for ‘malloc’ (Show Votes)
1 695606 x11-libs/libXvMC-1.0.12 - Detected file collision(s): /usr/include/X11/extensions/vldXvMC.h (Show Votes)
1 698148 xfce-extra/xfce4-datetime-plugin-0.8.0 : datetime.c:721:32: error: expected expression before t_datetime (Show Votes)
1 698632 media-video/mpv-0.30.0 USE=vaapi - waf: error: no such option: --enable-vaapi-glx (Show Votes)
1 700492 app-office/abiword-3.0.2-r2 : ./.../libabiword-3.0.so: error: undefined reference to g_module_close (Show Votes)
1 700832 dev-qt/qtwayland-5.13.2-r1 with >=media-libs/mesa-19.3.0_rc4: ../../../../hardwareintegration/compositor/linux-dmabuf-unstable-v1/linuxdmabufclientbufferintegration.h:92:5: error: ‘PFNEGLBINDWAYLANDDISPLAYWL’ does not name a type (Show Votes)
1 704966 net-libs/nodejs-13.6.0 with sys-devel/binutils' ld.gold - ld: error: .../work/node-v13.6.0/src/large_pages/ld.implicit.script:10:10: syntax error, unexpected STRING (Show Votes)
1 710652 app-office/texstudio-2.12.22: wrong SRC_URI (Show Votes)
1 717026 app-emulation/wine-staging-5.6 fails to apply wine-5.0-memset-O3.patch (Show Votes)
1 721806 app-office/libreoffice-6.4.3.2 with dev-libs/boost-1.73.0 - .../boost/bimap/detail/bimap_core.hpp:410:7: error: no class template named ‘rebind’ in ‘boost::bimaps::detail::manage_additional_parameters<mpl_::na, mpl_::na, mpl_::na>::case_NNN::allocator’ (Show Votes)
1 722002 sys-fs/bcache-tools-1.0.8_p20140220-r1 : bcache-super-show.c:(.text.startup+<snip>): undefined reference to crc64 (Show Votes)
1 733052 =gnome-base/gvfs-1.42.2 ERROR: Dependency "libplist" not found (Show Votes)
1 733350 xfce-extra/xfce4-diskperf-plugin-2.6.2 : /.../libdiskperf.ver:2: syntax error in VERSION script (Show Votes)
1 775962 sys-apps/mtree-1.0.4 - compare.c: error: struct stat has no member named st_mtimespec (Show Votes)
1 785760 www-client/w3m-0.5.3_p20210102 error: gettext infrastructure mismatch (Show Votes)
1 796764 media-libs/mesa-9999 enable i965 gallium driver aka crocus (Show Votes)
1 813447 dev-db/mariadb-10.6: version bump (Show Votes)
1 820521 sci-libs/vtk-9.0.3: fatal error: proj_api.h: No such file or directory (Show Votes)
1 832584 gnome-base/librsvg-2.52.5 fails to build with rust 1.58 (Show Votes)
1 836563 gnome-base/librsvg-2.54.0 - make: [Makefile:<snip>: build.stamp] Error 1 (Show Votes)
1 837122 www-client/firefox-99.0: Needs ~ 64 GB RAM to build with specific use flags (Show Votes)
1 843311 app-office/libreoffice-7.3.2.2-r1 [pdfimport] fails to build with app-text/poppler-22.05.0 (Show Votes)
50 votes used out of 50 allowed.

Portage Development (bug list)
1 680034 sys-apps/sandbox-2.16: error: Unable to determine LIBC PATH (/lib64/libc.so.6") (Show Votes)
1 vote used out of 10 allowed.

View all as bug list

Help with voting.