Gentoo Websites Logo
Go to: Gentoo Home Documentation Forums Lists Bugs Planet Store Wiki Get Gentoo!
Votes Bug # Summary
Gentoo Hosted Projects (bug list)
1 282928 dev-util/catalyst doesn't work over NFS (Show Votes)
1 vote used out of 5 allowed.

Gentoo Linux (bug list)
1 219559 games-rpg/vegastrike 0.5.0 (Show Votes)
1 231106 dev-lang/factor - Add ebuild for factor programming language (Show Votes)
1 231396 net-fs/nfs-utils - heimdal compatibility (Show Votes)
1 317311 dev-db/cassandra - an open source distributed database management system designed to handle large amounts of data (Show Votes)
1 333309 media-gfx/ocrfeeder: ebuild request (Show Votes)
1 337672 diaspora new package (Show Votes)
1 378027 [TRACKER] Gentoo LiveDVD (Show Votes)
1 433161 sys-devel/gcc-config: switching versions does not cleanly migrate with non-split /usr (Show Votes)
1 470192 net-voip/siptosis - SIP to Skype Gateway (Show Votes)
1 498414 net-misc/rfc5766-turn-server - a VoIP media traffic NAT traversal server and gateway (Show Votes)
1 500802 net-misc/restund-0.4.2 - a modular and flexible STUN and TURN Server, with IPv4 and IPv6 support (Show Votes)
1 581754 net-misc/chrome-remote-desktop does not work for chromium (Show Votes)
1 587332 media-libs/openimageio-1.6.13 : make[2]: *** No rule to make target '/var/tmp/portage/media-libs/openimageio-1.6.13/work/openimageio-1.6.13/src/doc/iv', needed by 'src/doc/iv.1'. Stop. (Show Votes)
1 589080 sci-visualization/slicer - 3d DICOM viewer (Show Votes)
1 594576 cross-x86_64-w64-mingw32/mingw64-runtime-4.0.6: configure: error: Please check if the mingw-w64 header set and the build/host option are set properly. (Show Votes)
1 613278 net-print/gutenprint-5.2.12 emerge fails, cannot find gtk includes (Show Votes)
1 616086 media-libs/openimageio-1.6.13[opencv] with >=media-libs/opencv-3.2.0 - src/include/OpenImageIO/imagebufalgo.h:51:8: error: using typedef-name ‘IplImage’ after ‘struct’ (Show Votes)
1 616090 =media-libs/openimageio-1.6.13 USE=opencv with media-libs/opencv-3.2.0 - .../work/openimageio-1.6.13/src/include/OpenImageIO/imagebufalgo.h:51:8: error: using typedef-name ‘IplImage’ after ‘struct’ (Show Votes)
1 642758 >=media-sound/audacity-2.1.3-r1: libtool: tag not specified (build error) when using ENV (Show Votes)
1 656722 app-emulation/vice-3.4 version bump (Show Votes)
1 663004 www-client/chromium-70.0.3510.0 fails to compile with "error: no template named 'unique_ptr' in namespace 'std'" (Show Votes)
1 688658 app-doc/doxygen-1.8.16: with USE=doc [doc/CMakeFiles/doxygen_pdf.dir/build.make:62: doc/CMakeFiles/doxygen_pdf] Error 1 (Show Votes)
22 votes used out of 50 allowed.

View all as bug list

Help with voting.