Gentoo Websites Logo
Go to: Gentoo Home Documentation Forums Lists Bugs Planet Store Wiki Get Gentoo!
Bug 950568 - dev-build/muon fails 'meson-tests/frameworks/7 gnome' test
Summary: dev-build/muon fails 'meson-tests/frameworks/7 gnome' test
Status: RESOLVED FIXED
Alias: None
Product: Gentoo Linux
Classification: Unclassified
Component: Keywording (show other bugs)
Hardware: All Linux
: Normal normal
Assignee: Arsen Arsenović
URL:
Whiteboard:
Keywords: PullRequest, TESTFAILURE
Depends on:
Blocks: 950500
  Show dependency tree
 
Reported: 2025-03-03 23:58 UTC by Jakov Smolić
Modified: 2025-03-07 11:48 UTC (History)
1 user (show)

See Also:
Package list:
Runtime testing required: ---


Attachments
Build log (build.log,215.80 KB, text/x-log)
2025-03-03 23:58 UTC, Jakov Smolić
no flags Details
testlog (testlog.txt,377.24 KB, text/plain)
2025-03-03 23:59 UTC, Jakov Smolić
no flags Details

Note You need to log in before you can comment on or make changes to this bug.
Description Jakov Smolić archtester gentoo-dev 2025-03-03 23:58:45 UTC
Created attachment 920191 [details]
Build log

dbg env: MUON_PATH='/var/tmp/portage/dev-build/muon-0.4.0/work/muon-0.4.0-build/muon' MESON_BUILD_ROOT='/var/tmp/portage/dev-build/muon-0.4.0/work/muon-0.4.0-build/tests/project/meson-tests/frameworks/7 gnome' MESON_SOURCE_ROOT='/var/tmp/portage/dev-build/muon-0.4.0/work/muon-v0.4.0/subprojects/meson-tests/frameworks/7 gnome' MESON_SUBDIR='resources'
dbg adding custom target 'simple-resources_c'
dbg adding custom target 'simple-resources_h'
dbg adding build target simple-resources-test
dbg adding custom target 'generated-resources_c'
dbg adding custom target 'generated-resources_h'
dbg adding build target generated-resources-test
dbg adding custom target 'simple-ct.gresource.xml'
dbg adding custom target 'ct-resources_c'
dbg adding custom target 'ct-resources_h'
dbg adding custom target 'cti-resources_c'
dbg adding custom target 'cti-resources_h'
dbg adding custom target 'build-resources_gresource'
dbg adding custom target 'gsettings-compileschemas'
dbg adding build target schemaprog
modules/gnome.meson:304:22: error program not found
304 |         find_program('gdbus-codegen'),
                           ^______________
modules/gnome.meson:304:9: error in find_program
304 |         find_program('gdbus-codegen'),
              ^____________________________
modules/gnome.meson:304:9: error in gdbus_codegen
304 |         find_program('gdbus-codegen'),
              ^____________________________
/var/tmp/portage/dev-build/muon-0.4.0/work/muon-v0.4.0/subprojects/meson-tests/frameworks/7 gnome/meson.build:69:1: error in subdir
 69 | subdir('gdbus')
      ^______________


333/350 muon:analyze / modules/i18n.meson                                                                                [1;32mOK            [0m  0.17s
334/350 muon:analyze / runtime/dependencies.meson                                                                        [1;32mOK            [0m  0.15s
[335-350/350] 🌗 muon:project+meson-tests+requires_python / meson-tests/frameworks/6 gettext                                             0/30s[K335/350 muon:project+meson-tests / meson-tests/common/205 native file path override                                      [1;32mOK            [0m  4.87s
[336-350/350] 🌘 muon:project+meson-tests+requires_python / meson-tests/frameworks/6 gettext                                             0/30s[K336/350 muon:project+meson-tests / meson-tests/native/8 external program shebang parsing                                 [1;32mOK            [0m  1.12s
[337-350/350] 🌑 muon:project+meson-tests+requires_python / meson-tests/frameworks/6 gettext                                             0/30s[K337/350 muon:project+meson-tests / meson-tests/common/207 warning level 0                                                [1;32mOK            [0m  4.83s
[338-350/350] 🌒 muon:project+meson-tests+requires_python / meson-tests/frameworks/6 gettext                                             0/30s[K338/350 muon:project+meson-tests / meson-tests/native/9 override with exe                                                [1;32mOK            [0m  1.19s
[339-350/350] 🌓 muon:project+meson-tests+requires_python / meson-tests/frameworks/6 gettext                                             0/30s[K339/350 muon:project+meson-tests+requires_python / meson-tests/native/3 pipeline                                         [1;32mOK            [0m  1.50s
[340-350/350] 🌔 muon:project+meson-tests+requires_python / meson-tests/frameworks/6 gettext                                             0/30s[K340/350 muon:project+meson-tests / meson-tests/common/215 source set realistic example                                   [1;32mOK            [0m  4.62s
[341-350/350] 🌕 muon:project+meson-tests+requires_python / meson-tests/frameworks/6 gettext                                             0/30s[K341/350 muon:project+meson-tests+requires_python / meson-tests/native/5 install script                                   [1;32mOK            [0m  1.50s
[342-350/350] 🌖 muon:project+meson-tests+requires_python / meson-tests/frameworks/6 gettext                                             0/30s[K[342-350/350] 🌗 muon:project+meson-tests / meson-tests/native/7 selfbuilt custom                                                        1/30s[K342/350 muon:project+meson-tests / meson-tests/common/264 required keyword in has functions                              [1;32mOK            [0m  2.69s
[343-350/350] 🌘 muon:project+meson-tests / meson-tests/native/7 selfbuilt custom                                                        1/30s[K343/350 muon:project+meson-tests+requires_python / meson-tests/frameworks/6 gettext                                      [1;32mOK            [0m  1.22s
[344-350/350] 🌑 muon:project+meson-tests / meson-tests/native/7 selfbuilt custom                                                        1/30s[K344/350 muon:project+meson-tests / meson-tests/common/223 persubproject options                                          [1;32mOK            [0m  4.82s
[345-350/350] 🌒 muon:project+meson-tests / meson-tests/native/7 selfbuilt custom                                                        1/30s[K345/350 muon:project+meson-tests / meson-tests/common/36 has function                                                    [1;32mOK            [0m 13.72s
[346-350/350] 🌓 muon:project+meson-tests / meson-tests/native/7 selfbuilt custom                                                        1/30s[K346/350 muon:project+meson-tests / meson-tests/common/103 has header symbol                                              [1;32mOK            [0m 11.25s
[347-350/350] 🌔 muon:project+meson-tests / meson-tests/native/7 selfbuilt custom                                                        2/30s[K[347-350/350] 🌕 muon:project+meson-tests / meson-tests/native/6 add language                                                            2/30s[K347/350 muon:project+meson-tests / meson-tests/native/4 tryrun                                                           [1;32mOK            [0m  3.67s
[348-350/350] 🌖 muon:project+meson-tests / meson-tests/native/6 add language                                                            3/30s[K348/350 muon:project+meson-tests / meson-tests/native/6 add language                                                     [1;32mOK            [0m  3.58s
[349-350/350] 🌗 muon:project+meson-tests / meson-tests/common/197 function attributes                                                   7/30s[K[349-350/350] 🌘 muon:project+meson-tests / meson-tests/native/7 selfbuilt custom                                                        3/30s[K349/350 muon:project+meson-tests / meson-tests/native/7 selfbuilt custom                                                 [1;32mOK            [0m  4.29s
[350/350] 🌑 muon:project+meson-tests / meson-tests/common/197 function attributes                                                       8/30s[K[350/350] 🌒 muon:project+meson-tests / meson-tests/common/197 function attributes                                                       8/30s[K[350/350] 🌓 muon:project+meson-tests / meson-tests/common/197 function attributes                                                       9/30s[K[350/350] 🌔 muon:project+meson-tests / meson-tests/common/197 function attributes                                                      10/30s[K[350/350] 🌕 muon:project+meson-tests / meson-tests/common/197 function attributes                                                      11/30s[K[350/350] 🌖 muon:project+meson-tests / meson-tests/common/197 function attributes                                                      12/30s[K[350/350] 🌗 muon:project+meson-tests / meson-tests/common/197 function attributes                                                      13/30s[K350/350 muon:project+meson-tests / meson-tests/common/197 function attributes                                            [1;32mOK            [0m 13.69s

Summary of Failures:

332/350 muon:project+meson-tests+requires_python / meson-tests/frameworks/7 gnome                               [1;31mFAIL          [0m  0.62s   exit status 1

Ok:                 335 
Expected Fail:      4   
Fail:               1   
Unexpected Pass:    0   
Skipped:            10  
Timeout:            0   

Full log written to /var/tmp/portage/dev-build/muon-0.4.0/work/muon-0.4.0-build/meson-logs/testlog.txt
 [31;01m*[0m ERROR: dev-build/muon-0.4.0::gentoo failed (test phase):
 [31;01m*[0m   tests failed
 [31;01m*[0m 
 [31;01m*[0m Call stack:
 [31;01m*[0m     ebuild.sh, line  136:  Called src_test
 [31;01m*[0m   environment, line 2515:  Called meson_src_test
 [31;01m*[0m   environment, line 1785:  Called die
 [31;01m*[0m The specific snippet of code:
 [31;01m*[0m       [[ ${rv} -eq 0 ]] || die -n "tests failed";
 [31;01m*[0m 
 [31;01m*[0m If you need support, post the output of `emerge --info '=dev-build/muon-0.4.0::gentoo'`,
 [31;01m*[0m the complete build log and the output of `emerge -pqv '=dev-build/muon-0.4.0::gentoo'`.
 [31;01m*[0m The complete build log is located at '/var/tmp/portage/dev-build/muon-0.4.0/temp/build.log'.
 [31;01m*[0m The ebuild environment file is located at '/var/tmp/portage/dev-build/muon-0.4.0/temp/environment'.
 [31;01m*[0m Working directory: '/var/tmp/portage/dev-build/muon-0.4.0/work/muon-0.4.0-build'
 [31;01m*[0m S: '/var/tmp/portage/dev-build/muon-0.4.0/work/muon-v0.4.0'
Comment 1 Jakov Smolić archtester gentoo-dev 2025-03-03 23:59:09 UTC
Created attachment 920192 [details]
testlog
Comment 2 Jakov Smolić archtester gentoo-dev 2025-03-04 00:00:53 UTC
# emerge --info:

Portage 3.0.67 (python 3.12.9-final-0, default/linux/riscv/23.0/rv64/lp64d/systemd, gcc-14, glibc-2.40-r8, 6.1.31 riscv64)
=================================================================
System uname: Linux-6.1.31-riscv64-with-glibc2.40
KiB Mem:   131976904 total, 130596772 free
KiB Swap:          0 total,         0 free
sh bash 5.2_p37
ld GNU ld (Gentoo 2.44 p1) 2.44.0
app-misc/pax-utils:        1.3.8::gentoo
app-shells/bash:           5.2_p37::gentoo
dev-build/autoconf:        2.72-r1::gentoo
dev-build/automake:        1.17-r1::gentoo
dev-build/cmake:           3.31.6::gentoo
dev-build/libtool:         2.5.4::gentoo
dev-build/make:            4.4.1-r100::gentoo
dev-build/meson:           1.7.0::gentoo
dev-lang/perl:             5.40.0-r1::gentoo
dev-lang/python:           3.12.9::gentoo, 3.13.2::gentoo
dev-lang/rust-bin:         1.85.0-r1::gentoo
sys-apps/baselayout:       2.17::gentoo
sys-apps/sandbox:          2.43::gentoo
sys-apps/systemd:          257.2::gentoo
sys-devel/binutils:        2.44::gentoo
sys-devel/binutils-config: 5.5.2::gentoo
sys-devel/gcc:             14.2.1_p20241221::gentoo
sys-devel/gcc-config:      2.12.1::gentoo
sys-kernel/linux-headers:  6.13::gentoo (virtual/os-headers)
sys-libs/glibc:            2.40-r8::gentoo
Repositories:

gentoo
    location: /var/db/repos/gentoo
    sync-type: rsync
    sync-uri: rsync://rsync.gentoo.org/gentoo-portage
    priority: -1000
    volatile: True
    sync-rsync-extra-opts:
    sync-rsync-verify-metamanifest: yes
    sync-rsync-verify-jobs: 1
    sync-rsync-verify-max-age: 3

Binary Repositories:

gentoobinhost
    priority: 1
    sync-uri: https://distfiles.gentoo.org/releases/riscv/binpackages/23.0/rv64_lp64d

ACCEPT_KEYWORDS="riscv ~riscv"
ACCEPT_LICENSE="@FREE"
CBUILD="riscv64-unknown-linux-gnu"
CFLAGS="-O2 -pipe"
CHOST="riscv64-unknown-linux-gnu"
CONFIG_PROTECT="/etc /usr/share/gnupg/qualified.txt"
CONFIG_PROTECT_MASK="/etc/ca-certificates.conf /etc/env.d /etc/fonts/fonts.conf /etc/gconf /etc/gentoo-release /etc/revdep-rebuild /etc/sandbox.d /etc/texmf/language.dat.d /etc/texmf/language.def.d /etc/texmf/updmap.d /etc/texmf/web2c"
CXXFLAGS="-O2 -pipe"
DISTDIR="/var/cache/distfiles"
EMERGE_DEFAULT_OPTS="--jobs=5"
ENV_UNSET="CARGO_HOME DBUS_SESSION_BUS_ADDRESS DISPLAY GDK_PIXBUF_MODULE_FILE GOBIN GOPATH PERL5LIB PERL5OPT PERLPREFIX PERL_CORE PERL_MB_OPT PERL_MM_OPT XAUTHORITY XDG_CACHE_HOME XDG_CONFIG_HOME XDG_DATA_HOME XDG_RUNTIME_DIR XDG_STATE_HOME"
FCFLAGS="-O2 -pipe"
FEATURES="assume-digests binpkg-docompress binpkg-dostrip binpkg-logs binpkg-multi-instance buildpkg-live config-protect-if-modified distlocks ebuild-locks fixlafiles merge-sync merge-wait multilib-strict news parallel-fetch pkgdir-index-trusted preserve-libs protect-owned qa-unresolved-soname-deps sandbox strict unknown-features-warn unmerge-logs unmerge-orphans userfetch userpriv usersandbox usersync xattr"
FFLAGS="-O2 -pipe"
GENTOO_MIRRORS="http://distfiles.gentoo.org"
LANG="C.UTF8"
LDFLAGS="-Wl,-O1 -Wl,--as-needed"
LEX="flex"
MAKEOPTS="-j32 -l32"
PKGDIR="/var/cache/binpkgs"
PORTAGE_CONFIGROOT="/"
PORTAGE_RSYNC_OPTS="--recursive --links --safe-links --perms --times --omit-dir-times --compress --force --whole-file --delete --stats --human-readable --timeout=180 --exclude=/distfiles --exclude=/local --exclude=/packages --exclude=/.git"
PORTAGE_TMPDIR="/var/tmp"
USE="acl bzip2 crypt gdbm iconv ipv6 ncurses nls openmp pam pcre readline riscv seccomp ssl systemd test-rust udev unicode xattr zlib" ADA_TARGET="gcc_14" APACHE2_MODULES="authn_core authz_core socache_shmcb unixd actions alias auth_basic authn_anon authn_dbm authn_file authz_dbm authz_groupfile authz_host authz_owner authz_user autoindex cache cgi cgid dav dav_fs dav_lock deflate dir env expires ext_filter file_cache filter headers include info log_config logio mime mime_magic negotiation rewrite setenvif speling status unique_id userdir usertrack vhost_alias" CALLIGRA_FEATURES="karbon sheets words" COLLECTD_PLUGINS="df interface irq load memory rrdtool swap syslog" ELIBC="glibc" GPSD_PROTOCOLS="ashtech aivdm earthmate evermore fv18 garmin garmintxt gpsclock greis isync itrax navcom oceanserver oncore rtcm104v2 rtcm104v3 sirf skytraq superstar2 tsip tripmate tnt ublox" GUILE_SINGLE_TARGET="3-0" GUILE_TARGETS="3-0" INPUT_DEVICES="libinput" KERNEL="linux" LCD_DEVICES="bayrad cfontz glk hd44780 lb216 lcdm001 mtxorb text" LUA_SINGLE_TARGET="lua5-1" LUA_TARGETS="lua5-1" OFFICE_IMPLEMENTATION="libreoffice" PHP_TARGETS="php8-2" POSTGRES_TARGETS="postgres16" PYTHON_SINGLE_TARGET="python3_12" PYTHON_TARGETS="python3_12" RUBY_TARGETS="ruby32" VIDEO_CARDS="fbdev" XTABLES_ADDONS="quota2 psd pknock lscan length2 ipv4options ipp2p iface geoip fuzzy condition tarpit sysrq proto logmark ipmark dhcpmac delude chaos account"
Unset:  ADDR2LINE, AR, ARFLAGS, AS, ASFLAGS, CC, CCLD, CONFIG_SHELL, CPP, CPPFLAGS, CTARGET, CXX, CXXFILT, ELFEDIT, EXTRA_ECONF, F77FLAGS, FC, GCOV, GPROF, INSTALL_MASK, LC_ALL, LD, LFLAGS, LIBTOOL, LINGUAS, MAKE, MAKEFLAGS, NM, OBJCOPY, OBJDUMP, PORTAGE_BINHOST, PORTAGE_BUNZIP2_COMMAND, PORTAGE_COMPRESS, PORTAGE_COMPRESS_FLAGS, PORTAGE_RSYNC_EXTRA_OPTS, PYTHONPATH, RANLIB, READELF, RUSTFLAGS, SHELL, SIZE, STRINGS, STRIP, YACC, YFLAGS
Comment 3 Larry the Git Cow gentoo-dev 2025-03-07 11:48:14 UTC
The bug has been closed via the following commit(s):

https://gitweb.gentoo.org/repo/gentoo.git/commit/?id=733a1c6cdf8a2e154d495cdc406a6f29ecdc4fa2

commit 733a1c6cdf8a2e154d495cdc406a6f29ecdc4fa2
Author:     Jakov Smolić <jsmolic@gentoo.org>
AuthorDate: 2025-03-04 23:45:19 +0000
Commit:     Jakov Smolić <jsmolic@gentoo.org>
CommitDate: 2025-03-07 11:47:54 +0000

    dev-build/muon: Add missing dev-util/gdbus-codegen test dep
    
    Closes: https://bugs.gentoo.org/950568
    Signed-off-by: Jakov Smolić <jsmolic@gentoo.org>

 dev-build/muon/muon-0.4.0.ebuild | 1 +
 1 file changed, 1 insertion(+)