Gentoo Websites Logo
Go to: Gentoo Home Documentation Forums Lists Bugs Planet Store Wiki Get Gentoo!
Bug 931563 - dev-python/sphinx-autoapi-3.0.0 fails tests: FAILED test_pyintegration.py::test_custom_jinja_filters - sphinx.errors.SphinxWarning: cannot cache unpickable configuration value: autoapi_prepare_jinja_env (because it contains a function, class, or module o
Summary: dev-python/sphinx-autoapi-3.0.0 fails tests: FAILED test_pyintegration.py::te...
Status: CONFIRMED
Alias: None
Product: Gentoo Linux
Classification: Unclassified
Component: Current packages (show other bugs)
Hardware: All Linux
: Normal normal (vote)
Assignee: Python Gentoo Team
URL:
Whiteboard:
Keywords: TESTFAILURE
Depends on:
Blocks:
 
Reported: 2024-05-08 11:36 UTC by Agostino Sarubbo
Modified: 2024-05-08 11:36 UTC (History)
2 users (show)

See Also:
Package list:
Runtime testing required: ---


Attachments
build.log (build.log,236.43 KB, text/plain)
2024-05-08 11:36 UTC, Agostino Sarubbo
Details

Note You need to log in before you can comment on or make changes to this bug.
Description Agostino Sarubbo gentoo-dev 2024-05-08 11:36:40 UTC
https://blogs.gentoo.org/ago/2020/07/04/gentoo-tinderbox/

Issue: dev-python/sphinx-autoapi-3.0.0 fails tests.
Discovered on: amd64 (internal ref: lto_tinderbox)
System: LTO-SYSTEM (https://wiki.gentoo.org/wiki/Project:Tinderbox/Common_Issues_Helper#LTO)

Info about the issue:
https://wiki.gentoo.org/wiki/Project:Tinderbox/Common_Issues_Helper#CF0015
Comment 1 Agostino Sarubbo gentoo-dev 2024-05-08 11:36:42 UTC
Created attachment 892472 [details]
build.log

build log and emerge --info
Comment 2 Agostino Sarubbo gentoo-dev 2024-05-08 11:36:42 UTC
Error(s) that match a know pattern in addition to what has been reported in the summary:


ERROR setuptools_scm._file_finders.git listing git files failed - pretending there aren't any
FAILED tests/python/test_pyintegration.py::test_custom_jinja_filters - sphinx.errors.SphinxWarning: cannot cache unpickable configuration value: 'autoapi_prepare_jinja_env' (because it contains a function, class, or module object)
tests/python/test_pyintegration.py::test_custom_jinja_filters FAILED  [ 67/258]