Gentoo Websites Logo
Go to: Gentoo Home Documentation Forums Lists Bugs Planet Store Wiki Get Gentoo!
Bug 926513 - kde-plasma/powerdevil-6.0.1 fails several tests if run in parallel
Summary: kde-plasma/powerdevil-6.0.1 fails several tests if run in parallel
Status: UNCONFIRMED
Alias: None
Product: Gentoo Linux
Classification: Unclassified
Component: Current packages (show other bugs)
Hardware: All Linux
: Normal normal (vote)
Assignee: Gentoo KDE team
URL:
Whiteboard:
Keywords: TESTFAILURE
Depends on:
Blocks: parallel-make
  Show dependency tree
 
Reported: 2024-03-08 16:13 UTC by Paolo Pedroni
Modified: 2024-03-08 18:25 UTC (History)
1 user (show)

See Also:
Package list:
Runtime testing required: ---


Attachments
powerdevil-6.0.1:20240308-160602.log.gz - parallel tests (powerdevil-6.0.1:20240308-160602.log.gz,22.12 KB, application/gzip)
2024-03-08 16:13 UTC, Paolo Pedroni
Details
powerdevil-6.0.1:20240308-160031.log.gz - non parallel tests (powerdevil-6.0.1:20240308-160031.log.gz,21.32 KB, application/gzip)
2024-03-08 16:14 UTC, Paolo Pedroni
Details
LastTest.log - parallel tests (Powerdevil-j32-LastTest.log,13.23 KB, text/x-log)
2024-03-08 16:15 UTC, Paolo Pedroni
Details
LastTest.log - non parallel tests (Powerdevil-j1-LastTest.log,11.02 KB, text/x-log)
2024-03-08 16:15 UTC, Paolo Pedroni
Details

Note You need to log in before you can comment on or make changes to this bug.
Description Paolo Pedroni 2024-03-08 16:13:58 UTC
Created attachment 887036 [details]
powerdevil-6.0.1:20240308-160602.log.gz - parallel tests

>>> Test phase: kde-plasma/powerdevil-6.0.1
 * Source directory (CMAKE_USE_DIR): "/var/tmp/portage/kde-plasma/powerdevil-6.0.1/work/powerdevil-6.0.1"
 * Build directory  (BUILD_DIR):     "/var/tmp/portage/kde-plasma/powerdevil-6.0.1/work/powerdevil-6.0.1_build"
ctest -j 32 --test-load 32
Test project /var/tmp/portage/kde-plasma/powerdevil-6.0.1/work/powerdevil-6.0.1_build
    Start 1: appstreamtest
    Start 2: migrateconfig_test1_default_configs_can_suspend_to_ram
    Start 3: migrateconfig_test2_activities
    Start 4: migrateconfig_test2a_activities_no_double_migration
    Start 5: migrateconfig_test3_profiles
    Start 6: migrateconfig_test4_profiles_more
1/6 Test #1: appstreamtest ............................................   Passed    0.01 sec
2/6 Test #2: migrateconfig_test1_default_configs_can_suspend_to_ram ...***Failed    0.03 sec
3/6 Test #4: migrateconfig_test2a_activities_no_double_migration ......   Passed    0.03 sec
4/6 Test #5: migrateconfig_test3_profiles .............................***Failed    0.03 sec
5/6 Test #3: migrateconfig_test2_activities ...........................***Failed    0.13 sec
6/6 Test #6: migrateconfig_test4_profiles_more ........................***Failed    0.13 sec

33% tests passed, 4 tests failed out of 6

Total Test time (real) =   0.14 sec

The following tests FAILED:
          2 - migrateconfig_test1_default_configs_can_suspend_to_ram (Failed)
          3 - migrateconfig_test2_activities (Failed)
          5 - migrateconfig_test3_profiles (Failed)
          6 - migrateconfig_test4_profiles_more (Failed)
Errors while running CTest
Output from these tests are in: /var/tmp/portage/kde-plasma/powerdevil-6.0.1/work/powerdevil-6.0.1_build/Testing/Temporary/LastTest.log
Use "--rerun-failed --output-on-failure" to re-run the failed cases verbosely.
 * ERROR: kde-plasma/powerdevil-6.0.1::gentoo failed (test phase)

While with MAKEOPTS=-j1 only 1 test fails:
>>> Test phase: kde-plasma/powerdevil-6.0.1
 * Source directory (CMAKE_USE_DIR): "/var/tmp/portage/kde-plasma/powerdevil-6.0.1/work/powerdevil-6.0.1"
 * Build directory  (BUILD_DIR):     "/var/tmp/portage/kde-plasma/powerdevil-6.0.1/work/powerdevil-6.0.1_build"
ctest -j 1 --test-load 999
Test project /var/tmp/portage/kde-plasma/powerdevil-6.0.1/work/powerdevil-6.0.1_build
    Start 1: appstreamtest
1/6 Test #1: appstreamtest ............................................   Passed    0.01 sec
    Start 2: migrateconfig_test1_default_configs_can_suspend_to_ram
2/6 Test #2: migrateconfig_test1_default_configs_can_suspend_to_ram ...***Failed    0.03 sec
    Start 3: migrateconfig_test2_activities
3/6 Test #3: migrateconfig_test2_activities ...........................   Passed    0.03 sec
    Start 4: migrateconfig_test2a_activities_no_double_migration
4/6 Test #4: migrateconfig_test2a_activities_no_double_migration ......   Passed    0.03 sec
    Start 5: migrateconfig_test3_profiles
5/6 Test #5: migrateconfig_test3_profiles .............................   Passed    0.03 sec
    Start 6: migrateconfig_test4_profiles_more
6/6 Test #6: migrateconfig_test4_profiles_more ........................   Passed    0.03 sec

83% tests passed, 1 tests failed out of 6

Total Test time (real) =   0.16 sec

The following tests FAILED:
          2 - migrateconfig_test1_default_configs_can_suspend_to_ram (Failed)
Errors while running CTest
Output from these tests are in: /var/tmp/portage/kde-plasma/powerdevil-6.0.1/work/powerdevil-6.0.1_build/Testing/Temporary/LastTest.log
Use "--rerun-failed --output-on-failure" to re-run the failed cases verbosely.
 * ERROR: kde-plasma/powerdevil-6.0.1::gentoo failed (test phase)

# emerge --info =kde-plasma/powerdevil-6.0.1
Portage 3.0.61 (python 3.11.8-final-0, default/linux/amd64/17.1/desktop/plasma/systemd/merged-usr, gcc-13, glibc-2.38-r10, 6.6.13-gentoo x86_64)
=================================================================
                         System Settings
=================================================================
System uname: Linux-6.6.13-gentoo-x86_64-AMD_Ryzen_9_7950X3D_16-Core_Processor-with-glibc2.38
KiB Mem:   131010060 total,  77339800 free
KiB Swap:  134217724 total, 134217724 free
Timestamp of repository gentoo: Fri, 08 Mar 2024 08:45:00 +0000
Head commit of repository gentoo: 499be6d549618ef6b88c2a4a78cf27dea4722105
Timestamp of repository qt: Fri, 08 Mar 2024 06:20:29 +0000
Head commit of repository qt: effe17b5c4005b7d8f25053a5f10b472a6415c1b

sh dash 0.5.12
ld GNU ld (Gentoo 2.41 p5) 2.41.0
distcc 3.4 x86_64-pc-linux-gnu [disabled]
ccache version 4.9.1 [disabled]
app-misc/pax-utils:        1.3.7::gentoo
app-shells/bash:           5.1_p16-r6::gentoo
dev-build/autoconf:        2.71-r6::gentoo
dev-build/automake:        1.16.5-r2::gentoo
dev-build/cmake:           3.27.9::gentoo
dev-build/libtool:         2.4.7-r2::gentoo
dev-build/make:            4.4.1-r1::gentoo
dev-build/meson:           1.3.1-r1::gentoo
dev-java/java-config:      2.3.3-r1::gentoo
dev-lang/perl:             5.38.2-r2::gentoo
dev-lang/python:           3.11.8_p1::gentoo, 3.12.2_p1::gentoo
dev-lang/rust:             1.74.1::gentoo
dev-util/ccache:           4.9.1::gentoo
sys-apps/baselayout:       2.14-r2::gentoo
sys-apps/sandbox:          2.38::gentoo
sys-apps/systemd:          255.3-r1::gentoo
sys-devel/binutils:        2.41-r5::gentoo
sys-devel/binutils-config: 5.5::gentoo
sys-devel/clang:           17.0.6::gentoo
sys-devel/gcc:             13.2.1_p20240113-r1::gentoo
sys-devel/gcc-config:      2.11::gentoo
sys-devel/lld:             17.0.6::gentoo
sys-devel/llvm:            17.0.6::gentoo
sys-kernel/linux-headers:  6.6::gentoo (virtual/os-headers)
sys-libs/glibc:            2.38-r10::gentoo
Repositories:

gentoo
    location: /var/db/repos/gentoo
    sync-type: rsync
    sync-uri: rsync://rsync.europe.gentoo.org/gentoo-portage
    priority: -1000
    volatile: True
    sync-rsync-verify-metamanifest: yes
    sync-rsync-extra-opts: 
    sync-rsync-verify-jobs: 1
    sync-rsync-verify-max-age: 24

qt
    location: /var/db/repos/qt
    sync-type: git
    sync-uri: https://github.com/gentoo-mirror/qt.git
    masters: gentoo
    volatile: False

x-portage
    location: /usr/local/portage
    masters: gentoo
    priority: 0
    volatile: True

Binary Repositories:

gentoobinhost
    priority: 1
    sync-uri: https://gentoo.osuosl.org/releases/amd64/binpackages/17.1/x86-64

ACCEPT_KEYWORDS="amd64"
ACCEPT_LICENSE="@FREE"
AR="/usr/bin/gcc-ar"
CBUILD="x86_64-pc-linux-gnu"
CFLAGS="-O2 -pipe -frecord-gcc-switches -march=znver4 -mshstk -flto=16 -Werror=odr -Werror=lto-type-mismatch -Werror=strict-aliasing"
CHOST="x86_64-pc-linux-gnu"
CONFIG_PROTECT="/etc /usr/lib64/libreoffice/program/sofficerc /usr/share/config /usr/share/easy-rsa /usr/share/gnupg/qualified.txt"
CONFIG_PROTECT_MASK="/etc/ca-certificates.conf /etc/dconf /etc/env.d /etc/fonts/fonts.conf /etc/gconf /etc/gentoo-release /etc/revdep-rebuild /etc/sandbox.d"
CXXFLAGS="-O2 -pipe -frecord-gcc-switches -march=znver4 -mshstk -flto=16 -Werror=odr -Werror=lto-type-mismatch -Werror=strict-aliasing"
DISTDIR="/var/cache/distfiles"
EMERGE_DEFAULT_OPTS="--keep-going y --with-bdeps y"
ENV_UNSET="CARGO_HOME DBUS_SESSION_BUS_ADDRESS DISPLAY GDK_PIXBUF_MODULE_FILE GOBIN GOPATH PERL5LIB PERL5OPT PERLPREFIX PERL_CORE PERL_MB_OPT PERL_MM_OPT XAUTHORITY XDG_CACHE_HOME XDG_CONFIG_HOME XDG_DATA_HOME XDG_RUNTIME_DIR XDG_STATE_HOME"
FCFLAGS="-O2 -pipe -frecord-gcc-switches -march=znver4 -mshstk -flto=16 -Werror=odr -Werror=lto-type-mismatch -Werror=strict-aliasing"
FEATURES="assume-digests binpkg-docompress binpkg-dostrip binpkg-logs binpkg-multi-instance buildpkg-live compress-build-logs config-protect-if-modified distlocks ebuild-locks fixlafiles ipc-sandbox merge-sync multilib-strict network-sandbox news parallel-fetch pid-sandbox pkgdir-index-trusted preserve-libs protect-owned qa-unresolved-soname-deps sandbox sfperms sign split-elog split-log strict test unknown-features-warn unmerge-logs unmerge-orphans userfetch userpriv usersandbox usersync xattr"
FFLAGS="-O2 -pipe -frecord-gcc-switches -march=znver4 -mshstk -flto=16 -Werror=odr -Werror=lto-type-mismatch -Werror=strict-aliasing"
GENTOO_MIRRORS="http://tux.rainside.sk/gentoo/ http://gentoo.mirror.root.lu/ ftp://tux.rainside.sk/gentoo/"
LANG="it_IT.utf8"
LDFLAGS="-Wl,-O1 -Wl,--as-needed -Wl,--hash-style=gnu -Wl,--sort-common"
LEX="flex"
MAKEOPTS="-j32 -l32"
NM="/usr/bin/gcc-nm"
PKGDIR="/var/cache/binpkgs"
PORTAGE_CONFIGROOT="/"
PORTAGE_RSYNC_OPTS="--recursive --links --safe-links --perms --times --omit-dir-times --compress --force --whole-file --delete --stats --human-readable --timeout=180 --exclude=/distfiles --exclude=/local --exclude=/packages --exclude=/.git"
PORTAGE_TMPDIR="/var/tmp"
RANLIB="/usr/bin/gcc-ranlib"
SHELL="/bin/bash"
USE="X a52 aac aalib acl acpi activities adns alsa amd64 ao audiofile avif bash-completion bluetooth branding brotli bzip2 cairo caps cdda cddb cdparanoia cdr cli colord crypt css cups curl dbus declarative dga djvu dri dts dvd dvdr encode exif expat fbcon ffmpeg fftw flac fontconfig foomaticdb fortran ftp gd gdbm geoip gif gimp gles2 gmp gnutls gphoto2 gpm graphviz gstreamer gtk gui guile handbook heif iconv icu idn imagemagick imlib introspection ipv6 java javascript jbig jemalloc jpeg jpeg2k jpegxl kde kf6compat kwallet lame lapack lcms libass libnotify libsamplerate libtirpc lm-sensors lto lua lz4 lzma lzo mad magic man mhash mmap mng mp3 mp4 mpeg multilib musicbrainz ncurses nls offensive ogg openal opencl opengl openmp opus pam pango pcre pdf pipewire plasma png policykit postscript ppds pulseaudio qml qt5 qt6 rdesktop readline recode samba screencast sctp sdl seccomp sndfile sockets sound speex spell sqlite ssl startup-notification svg symlink syslog systemd sysvipc taglib telemetry test test-rust theora threads tidy tiff truetype udev udisks unicode upower usb v4l vaapi vala verify-sig vim-syntax vnc vorbis vulkan wavpack wayland webp widgets win32codecs wmf wxwidgets x264 xattr xcb xft xinerama xml xpm xscreensaver xv xvid yahoo zip zlib zstd" ABI_X86="64" ADA_TARGET="gnat_2021" ALSA_CARDS="hda-intel virmidi" APACHE2_MODULES="authn_core authz_core socache_shmcb unixd actions alias auth_basic authn_anon authn_dbm authn_file authz_dbm authz_groupfile authz_host authz_owner authz_user autoindex cache cgi cgid dav dav_fs dav_lock deflate dir env expires ext_filter file_cache filter headers include info log_config logio mime mime_magic negotiation rewrite setenvif speling status unique_id userdir usertrack vhost_alias" CALLIGRA_FEATURES="karbon sheets words" CAMERAS="ptp2" COLLECTD_PLUGINS="df interface irq load memory rrdtool swap syslog" CPU_FLAGS_X86="aes avx avx2 avx512f avx512dq avx512cd avx512bw avx512vl avx512vbmi f16c fma3 mmx mmxext pclmul popcnt rdrand sha sse sse2 sse3 sse4_1 sse4_2 sse4a ssse3" CURL_SSL="gnutls" ELIBC="glibc" GPSD_PROTOCOLS="ashtech aivdm earthmate evermore fv18 garmin garmintxt gpsclock greis isync itrax mtk3301 ntrip navcom oceanserver oncore rtcm104v2 rtcm104v3 sirf skytraq superstar2 tsip tripmate tnt ublox" GRUB_PLATFORMS="efi-64" INPUT_DEVICES="libinput" KERNEL="linux" L10N="it en" LCD_DEVICES="bayrad cfontz glk hd44780 lb216 lcdm001 mtxorb text" LLVM_TARGETS="AMDGPU" LUA_SINGLE_TARGET="lua5-1" LUA_TARGETS="lua5-1" OFFICE_IMPLEMENTATION="libreoffice" PHP_TARGETS="php8-1" POSTGRES_TARGETS="postgres15" PYTHON_SINGLE_TARGET="python3_11" PYTHON_TARGETS="python3_11" RUBY_TARGETS="ruby31" VIDEO_CARDS="amdgpu radeon radeonsi" XTABLES_ADDONS="quota2 psd pknock lscan length2 ipv4options ipp2p iface geoip fuzzy condition tarpit sysrq proto logmark ipmark dhcpmac delude chaos account"
Unset:  ADDR2LINE, ARFLAGS, AS, ASFLAGS, CC, CCLD, CONFIG_SHELL, CPP, CPPFLAGS, CTARGET, CXX, CXXFILT, ELFEDIT, EXTRA_ECONF, F77FLAGS, FC, GCOV, GPROF, INSTALL_MASK, LC_ALL, LD, LFLAGS, LIBTOOL, LINGUAS, MAKE, MAKEFLAGS, OBJCOPY, OBJDUMP, PORTAGE_BINHOST, PORTAGE_BUNZIP2_COMMAND, PORTAGE_COMPRESS, PORTAGE_COMPRESS_FLAGS, PORTAGE_RSYNC_EXTRA_OPTS, PYTHONPATH, READELF, RUSTFLAGS, SIZE, STRINGS, STRIP, YACC, YFLAGS

=================================================================
                        Package Settings
=================================================================

kde-plasma/powerdevil-6.0.1::gentoo was built with the following:
USE="caps handbook -brightness-control -debug -test" ABI_X86="(64)"
FEATURES="unmerge-orphans pkgdir-index-trusted userpriv split-elog parallel-fetch usersync unmerge-logs protect-owned preserve-libs sfperms sign sandbox binpkg-dostrip binpkg-docompress distlocks xattr fixlafiles multilib-strict split-log compress-build-logs merge-sync qa-unresolved-soname-deps news unknown-features-warn strict config-protect-if-modified userfetch binpkg-multi-instance assume-digests binpkg-logs ebuild-locks network-sandbox buildpkg-live pid-sandbox usersandbox ipc-sandbox"

# emerge -1pqv =kde-plasma/powerdevil-6.0.1
[ebuild   R   ] kde-plasma/powerdevil-6.0.1  USE="caps handbook test* -brightness-control -debug"
Comment 1 Paolo Pedroni 2024-03-08 16:14:54 UTC
Created attachment 887037 [details]
powerdevil-6.0.1:20240308-160031.log.gz - non parallel tests
Comment 2 Paolo Pedroni 2024-03-08 16:15:31 UTC
Created attachment 887038 [details]
LastTest.log - parallel tests
Comment 3 Paolo Pedroni 2024-03-08 16:15:56 UTC
Created attachment 887039 [details]
LastTest.log - non parallel tests