Gentoo Websites Logo
Go to: Gentoo Home Documentation Forums Lists Bugs Planet Store Wiki Get Gentoo!
Bug 924425 - dev-python/python-lsp-black-2.0.0 fails tests with >=dev-python/black-24.2.0
Summary: dev-python/python-lsp-black-2.0.0 fails tests with >=dev-python/black-24.2.0
Status: CONFIRMED
Alias: None
Product: Gentoo Linux
Classification: Unclassified
Component: Current packages (show other bugs)
Hardware: All Linux
: Normal normal (vote)
Assignee: Andrew Nowa Ammerlaan
URL:
Whiteboard:
Keywords: TESTFAILURE
Depends on:
Blocks:
 
Reported: 2024-02-13 13:50 UTC by Agostino Sarubbo
Modified: 2024-02-16 16:37 UTC (History)
2 users (show)

See Also:
Package list:
Runtime testing required: ---


Attachments
build.log (build.log,83.33 KB, text/plain)
2024-02-13 13:50 UTC, Agostino Sarubbo
Details

Note You need to log in before you can comment on or make changes to this bug.
Description Agostino Sarubbo gentoo-dev 2024-02-13 13:50:05 UTC
https://blogs.gentoo.org/ago/2020/07/04/gentoo-tinderbox/

Issue: dev-python/python-lsp-black-2.0.0 fails tests.
Discovered on: amd64 (internal ref: clang-lld_tinderbox)
System: CLANG-LLD (https://wiki.gentoo.org/wiki/Project:Tinderbox/Common_Issues_Helper#CLANG-LLD)

Info about the issue:
https://wiki.gentoo.org/wiki/Project:Tinderbox/Common_Issues_Helper#CF0015
Comment 1 Agostino Sarubbo gentoo-dev 2024-02-13 13:50:08 UTC
Created attachment 884862 [details]
build.log

build log and emerge --info
Comment 2 Agostino Sarubbo gentoo-dev 2024-02-13 13:50:08 UTC
Error(s) that match a know pattern:


E       AssertionError: assert {'line_length': 88, 'fast': False, 'pyi': False, 'skip_string_normalization': False, 'skip_magic_trailing_comma': False, 'target_version': {<TargetVersion.PY38: 8>, <TargetVersion.PY39: 9>, <TargetVersion.PY310: 10>, <TargetVersion.PY311: 11>}, 'preview': False} == {'line_length': 88, 'target_version': set(), 'pyi': False, 'fast': False, 'skip_magic_trailing_comma': False, 'skip_string_normalization': False, 'preview': False}
E       AssertionError: assert {'line_length': 88, 'fast': False, 'pyi': False, 'skip_string_normalization': True, 'skip_magic_trailing_comma': True, 'target_version': {<TargetVersion.PY38: 8>, <TargetVersion.PY39: 9>, <TargetVersion.PY310: 10>, <TargetVersion.PY311: 11>}, 'preview': False} == {'line_length': 88, 'target_version': set(), 'pyi': False, 'fast': False, 'skip_magic_trailing_comma': True, 'skip_string_normalization': True, 'preview': False}
FAILED tests/test_plugin.py::test_load_config_defaults - AssertionError: assert {'line_length': 88, 'fast': False, 'pyi': False, 'sk...
FAILED tests/test_plugin.py::test_load_config_with_skip_options - AssertionError: assert {'line_length': 88, 'fast': False, 'pyi': False, 'sk...