Gentoo Websites Logo
Go to: Gentoo Home Documentation Forums Lists Bugs Planet Store Wiki Get Gentoo!
Bug 915666 - net-libs/sofia-sip-1.13.16 stable request
Summary: net-libs/sofia-sip-1.13.16 stable request
Status: IN_PROGRESS
Alias: None
Product: Gentoo Linux
Classification: Unclassified
Component: Stabilization (show other bugs)
Hardware: All Linux
: Normal normal (vote)
Assignee: Hans de Graaff
URL:
Whiteboard:
Keywords: CC-ARCHES, SECURITY, STABLEREQ
Depends on: 920903
Blocks: CVE-2023-22741, CVE-2023-32307
  Show dependency tree
 
Reported: 2023-10-13 05:44 UTC by Hans de Graaff
Modified: 2023-12-28 20:51 UTC (History)
5 users (show)

See Also:
Package list:
net-libs/sofia-sip-1.13.16
Runtime testing required: ---
nattka: sanity-check+


Attachments

Note You need to log in before you can comment on or make changes to this bug.
Description Hans de Graaff gentoo-dev Security 2023-10-13 05:44:52 UTC
Please test and mark stable.
Comment 1 Rolf Eike Beer archtester 2023-10-22 10:05:25 UTC
sparc done
Comment 2 matoro archtester 2023-12-11 01:34:55 UTC
Test fail on x86:

==========================================================
   sofia-sip 1.13.16: libsofia-sip-ua/su/test-suite.log
==========================================================
 
# TOTAL: 16
# PASS:  14
# SKIP:  0
# XFAIL: 0
# FAIL:  2
# XPASS: 0
# ERROR: 0
 
.. contents:: :depth: 2
 
FAIL: torture_su_tag
====================
 
torture_su_tag.c:259: su_tag_test test_stackargs() FAILED: *p++ != i or 129100401 != 2
FAIL torture_su_tag (exit status: 1)
 
FAIL: torture_su_root
=====================
 
*** bit out of range 0 - FD_SETSIZE on fd_set ***: terminated
FAIL torture_su_root (exit status: 134)
Comment 3 matoro archtester 2023-12-11 16:24:16 UTC
Same issue on arm64, might be issue with all arches.
Comment 4 matoro archtester 2023-12-11 16:24:42 UTC
Actually scratch that only the second fail, first is not present.

==========================================================
   sofia-sip 1.13.16: libsofia-sip-ua/su/test-suite.log
==========================================================
 
# TOTAL: 16
# PASS:  15
# SKIP:  0
# XFAIL: 0
# FAIL:  1
# XPASS: 0
# ERROR: 0
 
.. contents:: :depth: 2
 
FAIL: torture_su_root
=====================
 
*** bit out of range 0 - FD_SETSIZE on fd_set ***: terminated
FAIL torture_su_root (exit status: 134)
Comment 5 matoro archtester 2023-12-11 20:33:09 UTC
Different error on ppc...this will probably need at least 3 blockers.

make  check-TESTS
make[4]: Entering directory '/var/tmp/portage/net-libs/sofia-sip-1.13.16/work/sofia-sip-1.13.16/libsofia-sip-ua/nta'
make[5]: Entering directory '/var/tmp/portage/net-libs/sofia-sip-1.13.16/work/sofia-sip-1.13.16/libsofia-sip-ua/nta'
/bin/sh: /bin/sh: cannot execute binary file 
make[5]: *** [Makefile:1122: run_check_nta.log] Error 126
make[5]: *** Waiting for unfinished jobs.... 
/bin/sh: /bin/sh: cannot execute binary file 
make[5]: *** [Makefile:1129: run_test_nta_api.log] Error 126
/bin/sh: /bin/sh: cannot execute binary file 
make[5]: *** [Makefile:1136: run_test_nta.log] Error 126
make[5]: Leaving directory '/var/tmp/portage/net-libs/sofia-sip-1.13.16/work/sofia-sip-1.13.16/libsofia-sip-ua/nta'
make[4]: *** [Makefile:1104: check-TESTS] Error 2
make[4]: Leaving directory '/var/tmp/portage/net-libs/sofia-sip-1.13.16/work/sofia-sip-1.13.16/libsofia-sip-ua/nta'
make[3]: *** [Makefile:1191: check-am] Error 2
make[3]: Leaving directory '/var/tmp/portage/net-libs/sofia-sip-1.13.16/work/sofia-sip-1.13.16/libsofia-sip-ua/nta'
make[2]: *** [Makefile:1193: check] Error 2
make[2]: Leaving directory '/var/tmp/portage/net-libs/sofia-sip-1.13.16/work/sofia-sip-1.13.16/libsofia-sip-ua/nta'
make[1]: *** [Makefile:615: check-recursive] Error 1
make[1]: Leaving directory '/var/tmp/portage/net-libs/sofia-sip-1.13.16/work/sofia-sip-1.13.16/libsofia-sip-ua'
make: *** [Makefile:508: check-recursive] Error 1
Comment 6 Hans de Graaff gentoo-dev Security 2023-12-28 14:22:38 UTC
Are these issues regressions from sofia-sip 1.13.9?
Comment 7 matoro archtester 2023-12-28 20:48:47 UTC
(In reply to Hans de Graaff from comment #6)
> Are these issues regressions from sofia-sip 1.13.9?

It's somewhat tough to tell because 1.13.9 also has test failures, at least on ppc64 they do not look identical (i.e. the "cannot exec binary file" one is not there and it's instead just a regular test failure), but I think yes.