Gentoo Websites Logo
Go to: Gentoo Home Documentation Forums Lists Bugs Planet Store Wiki Get Gentoo!
Bug 913967 - app-containers/aardvark-dns-1.6.0 fails tests (PYTHON-3.12-SYSTEM): thread test::test::tests::test_backend_network_scoped_custom_dns_server panicked at assertion failed: (left == right)
Summary: app-containers/aardvark-dns-1.6.0 fails tests (PYTHON-3.12-SYSTEM): thread te...
Status: CONFIRMED
Alias: None
Product: Gentoo Linux
Classification: Unclassified
Component: Current packages (show other bugs)
Hardware: All Linux
: Normal normal (vote)
Assignee: Zac Medico
URL:
Whiteboard:
Keywords: TESTFAILURE
Depends on:
Blocks: 921826
  Show dependency tree
 
Reported: 2023-09-11 07:14 UTC by Agostino Sarubbo
Modified: 2024-01-11 17:00 UTC (History)
0 users

See Also:
Package list:
Runtime testing required: ---


Attachments
build.log (build.log,178.91 KB, text/plain)
2023-09-11 07:14 UTC, Agostino Sarubbo
Details

Note You need to log in before you can comment on or make changes to this bug.
Description Agostino Sarubbo gentoo-dev 2023-09-11 07:14:39 UTC
https://blogs.gentoo.org/ago/2020/07/04/gentoo-tinderbox/

Issue: app-containers/aardvark-dns-1.6.0 fails tests (PYTHON-3.12-SYSTEM).
Discovered on: amd64 (internal ref: python-3.12_tinderbox)

NOTE:
(PYTHON-3.12-SYSTEM) in the summary means that the bug was found on a machine that runs python-3.12 but this bug MAY or MAY NOT BE related to the new python version
Comment 1 Agostino Sarubbo gentoo-dev 2023-09-11 07:14:42 UTC
Created attachment 870281 [details]
build.log

build log and emerge --info
Comment 2 Agostino Sarubbo gentoo-dev 2023-09-11 07:14:42 UTC
Error(s) that match a know pattern in addition to what has been reported in the summary:


thread 'test::test::tests::test_backend_network_scoped_custom_dns_server' panicked at 'assertion failed: `(left == right)`
error: test failed, to rerun pass `--bin aardvark-dns`