Gentoo Websites Logo
Go to: Gentoo Home Documentation Forums Lists Bugs Planet Store Wiki Get Gentoo!
Bug 911836 - dev-python/sphinx-tabs-3.4.1-r1 fails tests (PYTHON-3.12-SYSTEM): AssertionError: FILES DIFFER:
Summary: dev-python/sphinx-tabs-3.4.1-r1 fails tests (PYTHON-3.12-SYSTEM): AssertionEr...
Status: RESOLVED OBSOLETE
Alias: None
Product: Gentoo Linux
Classification: Unclassified
Component: Current packages (show other bugs)
Hardware: All Linux
: Normal normal (vote)
Assignee: Python Gentoo Team
URL:
Whiteboard:
Keywords: TESTFAILURE
Depends on:
Blocks: 921826
  Show dependency tree
 
Reported: 2023-08-07 07:06 UTC by Agostino Sarubbo
Modified: 2024-03-24 02:42 UTC (History)
1 user (show)

See Also:
Package list:
Runtime testing required: ---


Attachments
build.log (build.log,232.92 KB, text/plain)
2023-08-07 07:06 UTC, Agostino Sarubbo
Details

Note You need to log in before you can comment on or make changes to this bug.
Description Agostino Sarubbo gentoo-dev 2023-08-07 07:06:14 UTC
https://blogs.gentoo.org/ago/2020/07/04/gentoo-tinderbox/

Issue: dev-python/sphinx-tabs-3.4.1-r1 fails tests (PYTHON-3.12-SYSTEM).
Discovered on: amd64 (internal ref: python-3.12_tinderbox)

NOTE:
(PYTHON-3.12-SYSTEM) in the summary means that the bug was found on a machine that runs python-3.12 but this bug MAY or MAY NOT BE related to the new python version
Comment 1 Agostino Sarubbo gentoo-dev 2023-08-07 07:06:17 UTC
Created attachment 867269 [details]
build.log

build log and emerge --info
Comment 2 Agostino Sarubbo gentoo-dev 2023-08-07 07:06:17 UTC
Error(s) that match a know pattern in addition to what has been reported in the summary:


E           AssertionError: FILES DIFFER:
ERROR tests/test_build.py::test_basic - AssertionError: FILES DIFFER:
ERROR tests/test_build.py::test_conditional_assets[index] - AssertionError: F...
ERROR tests/test_build.py::test_custom_lexer - AssertionError: FILES DIFFER:
ERROR tests/test_build.py::test_disable_closing - AssertionError: FILES DIFFER:
ERROR tests/test_build.py::test_disable_css_loading - AssertionError: FILES D...
ERROR tests/test_build.py::test_nested_markup - AssertionError: FILES DIFFER:
ERROR tests/test_build.py::test_no_tabs - AssertionError: FILES DIFFER:
ERROR tests/test_build.py::test_other_with_assets - AssertionError: FILES DIF...
FAILED tests/test_build.py::test_conditional_assets_html_assets_policy[index]
FAILED tests/test_build.py::test_conditional_assets_html_assets_policy[no_tabs1]
FAILED tests/test_build.py::test_conditional_assets_html_assets_policy[no_tabs2]
Comment 3 jy6x2b32pie9 2024-03-23 19:56:20 UTC
Bug is obsolete, dev-python/sphinx-tabs-3.4.5 is in portage and supports Python 3.12
Comment 4 Michał Górny archtester Gentoo Infrastructure gentoo-dev Security 2024-03-24 02:42:47 UTC
Mass-closing "PYTHON-3.12-SYSTEM" bugs.  Most of them are either obsolete (i.e. packages have 3.12 support already), or report issues completely tangential to Python 3.12 support.  Manually checking them is a waste of time.