Gentoo Websites Logo
Go to: Gentoo Home Documentation Forums Lists Bugs Planet Store Wiki Get Gentoo!
Bug 911780 - dev-python/prov-2.0.0 fails tests (PYTHON-3.12-SYSTEM): error: Test failed: <unittest.runner.TextTestResult run=960 errors=2 failures=0>
Summary: dev-python/prov-2.0.0 fails tests (PYTHON-3.12-SYSTEM): error: Test failed: <...
Status: CONFIRMED
Alias: None
Product: Gentoo Linux
Classification: Unclassified
Component: Current packages (show other bugs)
Hardware: All Linux
: Normal normal (vote)
Assignee: No maintainer - Look at https://wiki.gentoo.org/wiki/Project:Proxy_Maintainers if you want to take care of it
URL:
Whiteboard:
Keywords: TESTFAILURE
Depends on:
Blocks: 921826
  Show dependency tree
 
Reported: 2023-08-05 18:16 UTC by Agostino Sarubbo
Modified: 2024-01-11 17:00 UTC (History)
0 users

See Also:
Package list:
Runtime testing required: ---


Attachments
build.log (build.log,387.69 KB, text/plain)
2023-08-05 18:16 UTC, Agostino Sarubbo
Details

Note You need to log in before you can comment on or make changes to this bug.
Description Agostino Sarubbo gentoo-dev 2023-08-05 18:16:36 UTC
https://blogs.gentoo.org/ago/2020/07/04/gentoo-tinderbox/

Issue: dev-python/prov-2.0.0 fails tests (PYTHON-3.12-SYSTEM).
Discovered on: amd64 (internal ref: python-3.12_tinderbox)

NOTE:
(PYTHON-3.12-SYSTEM) in the summary means that the bug was found on a machine that runs python-3.12 but this bug MAY or MAY NOT BE related to the new python version
Comment 1 Agostino Sarubbo gentoo-dev 2023-08-05 18:16:39 UTC
Created attachment 867168 [details]
build.log

build log and emerge --info
Comment 2 Agostino Sarubbo gentoo-dev 2023-08-05 18:16:40 UTC
Error(s) that match a know pattern in addition to what has been reported in the summary:


FAILED (errors=2, expected failures=17)
error: Test failed: <unittest.runner.TextTestResult run=960 errors=2 failures=0>