Gentoo Websites Logo
Go to: Gentoo Home Documentation Forums Lists Bugs Planet Store Wiki Get Gentoo!
Bug 909749 - app-misc/khal-0.11.2 fails tests
Summary: app-misc/khal-0.11.2 fails tests
Alias: None
Product: Gentoo Linux
Classification: Unclassified
Component: Current packages (show other bugs)
Hardware: All Linux
: Normal normal (vote)
Assignee: Amy Liffey
Depends on:
Reported: 2023-07-06 06:39 UTC by Agostino Sarubbo
Modified: 2023-07-06 07:10 UTC (History)
0 users

See Also:
Package list:
Runtime testing required: ---

build.log (build.log,137.53 KB, text/plain)
2023-07-06 06:39 UTC, Agostino Sarubbo

Note You need to log in before you can comment on or make changes to this bug.
Description Agostino Sarubbo gentoo-dev 2023-07-06 06:39:56 UTC

Issue: app-misc/khal-0.11.2 fails tests.
Discovered on: amd64 (internal ref: ci)
Comment 1 Agostino Sarubbo gentoo-dev 2023-07-06 06:39:58 UTC
Created attachment 865170 [details]

build log and emerge --info
Comment 2 Agostino Sarubbo gentoo-dev 2023-07-06 06:39:59 UTC
Error(s) that match a know pattern:

E       AssertionError: assert not UnknownTimeZoneError('local')
E               pytz.exceptions.UnknownTimeZoneError: 'local'
        except UnicodeEncodeError:
        ... except UnknownTimeZoneError:
FAILED tests/ - AssertionError: assert not UnknownT...
FAILED tests/
FAILED tests/ - pytz.excep...
FAILED tests/ - pytz.e...
FAILED tests/ - pytz.exceptions.Unk...
Comment 3 Sam James archtester Gentoo Infrastructure gentoo-dev Security 2023-07-06 06:52:40 UTC
Huh, what's your system timezone?
Comment 4 Agostino Sarubbo gentoo-dev 2023-07-06 07:02:45 UTC
Comment 5 Agostino Sarubbo gentoo-dev 2023-07-06 07:10:15 UTC
(In reply to Sam James from comment #3)
> Huh, what's your system timezone?

(In reply to Agostino Sarubbo from comment #4)

'date' reports CEST, but if can help I do not have /etc/timezone