Gentoo Websites Logo
Go to: Gentoo Home Documentation Forums Lists Bugs Planet Store Wiki Get Gentoo!
Bug 894172 - dev-python/jupyter-server-fileid-0.6.0-r1 fails tests: FAILED[True]
Summary: dev-python/jupyter-server-fileid-0.6.0-r1 fails tests: FAILED
Alias: None
Product: Gentoo Linux
Classification: Unclassified
Component: Current packages (show other bugs)
Hardware: All Linux
: Normal normal (vote)
Assignee: Gentoo Science Related Packages
Keywords: PMASKED
Depends on: 915824
  Show dependency tree
Reported: 2023-02-13 13:09 UTC by Agostino Sarubbo
Modified: 2023-12-15 19:40 UTC (History)
3 users (show)

See Also:
Package list:
Runtime testing required: ---

build.log (build.log,88.43 KB, text/plain)
2023-02-13 13:09 UTC, Agostino Sarubbo

Note You need to log in before you can comment on or make changes to this bug.
Description Agostino Sarubbo gentoo-dev 2023-02-13 13:09:56 UTC

Issue: dev-python/jupyter_server_fileid-0.6.0-r1 fails tests.
Discovered on: amd64 (internal ref: ci)
Comment 1 Agostino Sarubbo gentoo-dev 2023-02-13 13:09:59 UTC
Created attachment 850682 [details]

build log and emerge --info
Comment 2 Agostino Sarubbo gentoo-dev 2023-02-13 13:10:00 UTC
Error(s) that match a know pattern in addition to what has been reported in the summary:

E       AssertionError: assert None == 'new_path/test_path'
FAILED tests/[True] - Assertion...
Comment 3 Michał Górny archtester Gentoo Infrastructure gentoo-dev Security 2023-02-17 06:36:57 UTC
I think it's flaky.