Gentoo Websites Logo
Go to: Gentoo Home Documentation Forums Lists Bugs Planet Store Wiki Get Gentoo!
Bug 892221 - dev-python/mkdocs-git-revision-date-localized-plugin-1.1.0 fails tests (LIBARCHIVE-SYSTEM)
Summary: dev-python/mkdocs-git-revision-date-localized-plugin-1.1.0 fails tests (LIBAR...
Alias: None
Product: Gentoo Linux
Classification: Unclassified
Component: Current packages (show other bugs)
Hardware: All Linux
: Normal normal (vote)
Assignee: Andrew Ammerlaan
Depends on:
Reported: 2023-01-27 11:40 UTC by Agostino Sarubbo
Modified: 2023-10-27 07:47 UTC (History)
1 user (show)

See Also:
Package list:
Runtime testing required: ---

build.log (build.log,117.06 KB, text/plain)
2023-01-27 11:40 UTC, Agostino Sarubbo

Note You need to log in before you can comment on or make changes to this bug.
Description Agostino Sarubbo gentoo-dev 2023-01-27 11:40:51 UTC

Issue: dev-python/mkdocs-git-revision-date-localized-plugin-1.1.0 fails tests (LIBARCHIVE-SYSTEM).
Discovered on: amd64 (internal ref: libarchive_tinderbox)

(LIBARCHIVE-SYSTEM) in the summary means that the bug was found on a machine that runs app-alternatives/tar and app-alternatives/cpio with [-gnu,+libarchive] but this bug MAY or MAY NOT BE related to the tar/cpio implementation.
Comment 1 Agostino Sarubbo gentoo-dev 2023-01-27 11:40:53 UTC
Created attachment 849283 [details]

build log and emerge --info
Comment 2 Agostino Sarubbo gentoo-dev 2023-01-27 11:40:54 UTC
Error(s) that match a know pattern:

E       AssertionError: 'mkdocs build' command failed
FAILED tests/ - AssertionError: 'mkd...
FAILED tests/ - AssertionError: 'mkdocs bui...
FAILED tests/ - AssertionError: 'mk...
FAILED tests/ - AssertionE...
FAILED tests/ - AssertionError: ...
FAILED tests/[mkdocs file: basic_project/mkdocs_exclude.yml]
FAILED tests/[mkdocs file: basic_project/mkdocs_theme_language.yml]
FAILED tests/[mkdocs file: basic_project/mkdocs_theme_locale_disabled.yml]
FAILED tests/[mkdocs file: basic_project/mkdocs_theme_locale.yml]
FAILED tests/[mkdocs file: basic_project/mkdocs_theme_no_locale.yml]
FAILED tests/[mkdocs file: basic_project/mkdocs_theme_timeago_instant.yml]
FAILED tests/[mkdocs file: basic_project/mkdocs_theme_timeago_locale.yml]
FAILED tests/[mkdocs file: basic_project/mkdocs_theme_timeago_override.yml]
FAILED tests/[mkdocs file: basic_project/mkdocs_theme_timeago.yml]
FAILED tests/[i18n/mkdocs_wrong_order.yml-should be defined after the i18n plugin in your mkdocs.yml]