Gentoo Websites Logo
Go to: Gentoo Home Documentation Forums Lists Bugs Planet Store Wiki Get Gentoo!
Bug 872158 - net-libs/stem-1.8.0_p20211118 fails tests (MUSL): test_compression_lzma - test_exit_used - test_install
Summary: net-libs/stem-1.8.0_p20211118 fails tests (MUSL): test_compression_lzma - tes...
Alias: None
Product: Gentoo Linux
Classification: Unclassified
Component: Current packages (show other bugs)
Hardware: All Linux
: Normal normal (vote)
Assignee: No maintainer - Look at if you want to take care of it
Depends on:
Reported: 2022-09-21 07:55 UTC by Agostino Sarubbo
Modified: 2023-01-28 20:08 UTC (History)
0 users

See Also:
Package list:
Runtime testing required: ---

build.log (build.log,178.26 KB, text/plain)
2022-09-21 07:55 UTC, Agostino Sarubbo

Note You need to log in before you can comment on or make changes to this bug.
Description Agostino Sarubbo gentoo-dev 2022-09-21 07:55:33 UTC

Issue: net-libs/stem-1.8.0_p20211118 fails tests (MUSL).
Discovered on: amd64 (internal ref: tinderbox_musl)

This machine uses MUSL libc
Comment 1 Agostino Sarubbo gentoo-dev 2022-09-21 07:55:35 UTC
Created attachment 813223 [details]

build log and emerge --info
Comment 2 Agostino Sarubbo gentoo-dev 2022-09-21 07:55:36 UTC
Error(s) that match a know pattern in addition to what has been reported in the summary:

" != "Trac[49 chars].
AssertionError: "Trac[49 chars].
AssertionError: 1 != 0
AssertionError: Unable to find site-packages, files include:
Exit relay for our connection to 64.15.11[144 chars]
FAIL: test_compression_lzma
FAIL: test_exit_used
FAIL: test_install
FAILED (failures=1, skipped=1)