Gentoo Websites Logo
Go to: Gentoo Home Documentation Forums Lists Bugs Planet Store Wiki Get Gentoo!
Bug 864449 - dev-cpp/abseil-cpp-20211102.0-r2 - .../work/abseil-cpp-20211102.0/absl/base/internal/unscaledcycleclock.cc:104:2: error: #error Must implement UnscaledCycleClock::Frequency() (on musl)
Summary: dev-cpp/abseil-cpp-20211102.0-r2 - .../work/abseil-cpp-20211102.0/absl/base/i...
Status: UNCONFIRMED
Alias: None
Product: Gentoo Linux
Classification: Unclassified
Component: Current packages (show other bugs)
Hardware: PPC64 Linux
: Normal normal (vote)
Assignee: Georgy Yakovlev
URL:
Whiteboard:
Keywords:
Depends on:
Blocks: musl-porting
  Show dependency tree
 
Reported: 2022-08-08 18:16 UTC by ernsteiswuerfel
Modified: 2022-08-08 18:17 UTC (History)
0 users

See Also:
Package list:
Runtime testing required: ---


Attachments
build.log (ppc64) (abseil-cpp-20211102.0-r2:20220808-155700.log,112.89 KB, text/plain)
2022-08-08 18:16 UTC, ernsteiswuerfel
Details
emerge --info (file_864449.txt,6.80 KB, text/plain)
2022-08-08 18:16 UTC, ernsteiswuerfel
Details

Note You need to log in before you can comment on or make changes to this bug.
Description ernsteiswuerfel archtester 2022-08-08 18:16:16 UTC
Created attachment 798909 [details]
build.log (ppc64)

[...]
FAILED: absl/base/CMakeFiles/base.dir/internal/unscaledcycleclock.cc.o 
/usr/bin/powerpc64-gentoo-linux-musl-g++ -Dbase_EXPORTS -I/var/tmp/portage/dev-cpp/abseil-cpp-20211102.0-r2/work/abseil-cpp-20211102.0  -Os -mcpu=970 -mtune=970 -pipe -fPIC -Wall -Wextra -Wcast-qual -Wconversion-null -Wformat-security -Wmissing-declarations -Woverlength-strings -Wpointer-arith -Wundef -Wunused-local-typedefs -Wunused-result -Wvarargs -Wvla -Wwrite-strings -DNOMINMAX -std=gnu++17 -MD -MT absl/base/CMakeFiles/base.dir/internal/unscaledcycleclock.cc.o -MF absl/base/CMakeFiles/base.dir/internal/unscaledcycleclock.cc.o.d -o absl/base/CMakeFiles/base.dir/internal/unscaledcycleclock.cc.o -c /var/tmp/portage/dev-cpp/abseil-cpp-20211102.0-r2/work/abseil-cpp-20211102.0/absl/base/internal/unscaledcycleclock.cc
/var/tmp/portage/dev-cpp/abseil-cpp-20211102.0-r2/work/abseil-cpp-20211102.0/absl/base/internal/unscaledcycleclock.cc:104:2: error: #error Must implement UnscaledCycleClock::Frequency()
  104 | #error Must implement UnscaledCycleClock::Frequency()
      |  ^~~~~
/var/tmp/portage/dev-cpp/abseil-cpp-20211102.0-r2/work/abseil-cpp-20211102.0/absl/base/internal/unscaledcycleclock.cc: In static member function 'static double absl::lts_20211102::base_internal::UnscaledCycleClock::Frequency()':
/var/tmp/portage/dev-cpp/abseil-cpp-20211102.0-r2/work/abseil-cpp-20211102.0/absl/base/internal/unscaledcycleclock.cc:106:1: warning: no return statement in function returning non-void [-Wreturn-type]
  106 | }
      | ^
ninja: build stopped: subcommand failed.
 * ERROR: dev-cpp/abseil-cpp-20211102.0-r2::gentoo failed (compile phase):
 *   ninja -v -j1 -l0 failed
Comment 1 ernsteiswuerfel archtester 2022-08-08 18:16:47 UTC
Created attachment 798911 [details]
emerge --info