Gentoo Websites Logo
Go to: Gentoo Home Documentation Forums Lists Bugs Planet Store Wiki Get Gentoo!
Bug 840200 - dev-lang/go-1.18.1 fails test - go tool dist: FAILED
Summary: dev-lang/go-1.18.1 fails test - go tool dist: FAILED
Status: CONFIRMED
Alias: None
Product: Gentoo Linux
Classification: Unclassified
Component: Current packages (show other bugs)
Hardware: All Linux
: Normal normal (vote)
Assignee: William Hubbs
URL:
Whiteboard:
Keywords: TESTFAILURE
Depends on:
Blocks:
 
Reported: 2022-04-22 14:53 UTC by Toralf Förster
Modified: 2022-04-22 14:54 UTC (History)
0 users

See Also:
Package list:
Runtime testing required: ---


Attachments
emerge-info.txt (emerge-info.txt,18.29 KB, text/plain)
2022-04-22 14:53 UTC, Toralf Förster
Details
dev-lang:go-1.18.1:20220422-132154.log (dev-lang:go-1.18.1:20220422-132154.log,13.43 KB, text/plain)
2022-04-22 14:53 UTC, Toralf Förster
Details
emerge-history.txt (emerge-history.txt,116.37 KB, text/plain)
2022-04-22 14:54 UTC, Toralf Förster
Details
environment (environment,60.54 KB, text/plain)
2022-04-22 14:54 UTC, Toralf Förster
Details
etc.portage.tar.bz2 (etc.portage.tar.bz2,6.76 KB, application/x-bzip)
2022-04-22 14:54 UTC, Toralf Förster
Details
logs.tar.bz2 (logs.tar.bz2,12.27 KB, application/x-bzip)
2022-04-22 14:54 UTC, Toralf Förster
Details

Note You need to log in before you can comment on or make changes to this bug.
Description Toralf Förster gentoo-dev 2022-04-22 14:53:56 UTC
skipped due to earlier error
skipped due to earlier error
skipped due to earlier error
skipped due to earlier error
go tool dist: FAILED
 * ERROR: dev-lang/go-1.18.1::gentoo failed (test phase):
 *   tests failed

  -------------------------------------------------------------------

  This is an unstable amd64 chroot image at a tinderbox (==build bot)
  name: 17.1_desktop-j4_test-20220420-221025

  -------------------------------------------------------------------

gcc-config -l:
 [1] x86_64-pc-linux-gnu-12.0.1 *
clang/llvm (if any):
clang version 14.0.1
Target: x86_64-pc-linux-gnu
Thread model: posix
InstalledDir: /usr/lib/llvm/14/bin
/usr/lib/llvm/14
14.0.1
Python 3.9.12
Available Ruby profiles:
  [1]   ruby26 (with Rubygems)
  [2]   ruby27 (with Rubygems)
  [3]   ruby31 (with Rubygems) *
Available Rust versions:
  [1]   rust-bin-1.60.0 *
The following VMs are available for generation-2:
*)	Eclipse Temurin JDK 11.0.14_p9 [openjdk-bin-11]
Available Java Virtual Machines:
  [1]   openjdk-bin-11  system-vm

The Glorious Glasgow Haskell Compilation System, version 8.10.4
php cli:
  [1]   php7.4
  [2]   php8.0
  [3]   php8.1 *

  HEAD of ::gentoo
commit f7ef1656c027d3da22573dc70bedd2c4a7a3d667
Author: Repository mirror & CI <repomirrorci@gentoo.org>
Date:   Fri Apr 22 12:04:40 2022 +0000

    2022-04-22 12:04:39 UTC

emerge -qpvO dev-lang/go
[ebuild     U ] dev-lang/go-1.18.1 [1.17.9] CPU_FLAGS_X86="sse2"
Comment 1 Toralf Förster gentoo-dev 2022-04-22 14:53:58 UTC
Created attachment 773246 [details]
emerge-info.txt
Comment 2 Toralf Förster gentoo-dev 2022-04-22 14:53:59 UTC
Created attachment 773249 [details]
dev-lang:go-1.18.1:20220422-132154.log
Comment 3 Toralf Förster gentoo-dev 2022-04-22 14:54:01 UTC
Created attachment 773252 [details]
emerge-history.txt
Comment 4 Toralf Förster gentoo-dev 2022-04-22 14:54:02 UTC
Created attachment 773255 [details]
environment
Comment 5 Toralf Förster gentoo-dev 2022-04-22 14:54:03 UTC
Created attachment 773258 [details]
etc.portage.tar.bz2
Comment 6 Toralf Förster gentoo-dev 2022-04-22 14:54:04 UTC
Created attachment 773261 [details]
logs.tar.bz2