Gentoo Websites Logo
Go to: Gentoo Home Documentation Forums Lists Bugs Planet Store Wiki Get Gentoo!
Bug 836894 - dev-util/qbs-1.19.1 fails test - ERROR: .../grpc.grpc.pb.cc.o: undefined reference to symbol _ZN4absl12lts_202111025MutexD1Ev
Summary: dev-util/qbs-1.19.1 fails test - ERROR: .../grpc.grpc.pb.cc.o: undefined refe...
Status: CONFIRMED
Alias: None
Product: Gentoo Linux
Classification: Unclassified
Component: Current packages (show other bugs)
Hardware: All Linux
: Normal normal (vote)
Assignee: Davide Pesavento
URL:
Whiteboard:
Keywords: TESTFAILURE
Depends on:
Blocks:
 
Reported: 2022-04-06 07:19 UTC by Toralf Förster
Modified: 2022-04-06 07:20 UTC (History)
1 user (show)

See Also:
Package list:
Runtime testing required: ---


Attachments
emerge-info.txt (emerge-info.txt,20.16 KB, text/plain)
2022-04-06 07:20 UTC, Toralf Förster
Details
dev-util:qbs-1.19.1:20220406-004659.log.bz2 (dev-util:qbs-1.19.1:20220406-004659.log.bz2,22.82 KB, application/x-bzip)
2022-04-06 07:20 UTC, Toralf Förster
Details
emerge-history.txt.bz2 (emerge-history.txt.bz2,83.22 KB, application/x-bzip)
2022-04-06 07:20 UTC, Toralf Förster
Details
environment (environment,61.30 KB, text/plain)
2022-04-06 07:20 UTC, Toralf Förster
Details
etc.portage.tar.bz2 (etc.portage.tar.bz2,20.61 KB, application/x-bzip)
2022-04-06 07:20 UTC, Toralf Förster
Details
temp.tar.bz2 (temp.tar.bz2,231.05 KB, application/x-bzip)
2022-04-06 07:20 UTC, Toralf Förster
Details

Note You need to log in before you can comment on or make changes to this bug.
Description Toralf Förster gentoo-dev 2022-04-06 07:19:58 UTC
too long lines were shrinked:

PASS   : TestApi::linkDynamicLibs()
PASS   : TestApi::linkDynamicAndStaticLibs()
QDEBUG : TestBlackbox::grpc(cpp) ERROR: /usr/bin/x86_64-pc-linux-gnu-g++ -Wl,-m,elf_x86_64 -m64 -o /var/tmp/portage/dev-util/qbs-1.19.1/work/qbs-src-1.19.1/tests/auto/blackbox/testWorkDir/grpc/default/grpc-cpp.46480777/grpc_cpp /var/tmp/portage/dev-util/qbs-1.19.1/work/qbs-src-1.19.1/tests/auto/blac

ERROR: /usr/lib/gcc/x86_64-pc-linux-gnu/11.2.1/../../../../x86_64-pc-linux-gnu/bin/ld: /var/tmp/portage/dev-util/qbs-1.19.1/work/qbs-src-1.19.1/tests/auto/blackbox/testWorkDir/grpc/default/grpc-cpp.46480777/9d3fdc41fc61615e/grpc.grpc.pb.cc.o: undefined reference to symbol '_ZN4absl12lts_202111025Mut
/usr/lib/gcc/x86_64-pc-linux-gnu/11.2.1/../../../../x86_64-pc-linux-gnu/bin/ld: /usr/lib64/libabsl_synchronization.so.2111.0.0: error adding symbols: DSO missing from command line
collect2: error: ld returned 1 exit status

  -------------------------------------------------------------------

  This is an unstable amd64 chroot image at a tinderbox (==build bot)
  name: 17.1_desktop_gnome_systemd-j4_test-20220327-230019

  -------------------------------------------------------------------

gcc-config -l:
 [1] x86_64-pc-linux-gnu-9.3.1
 [2] x86_64-pc-linux-gnu-11.2.1 *
clang/llvm (if any):
clang version 14.0.0
Target: x86_64-pc-linux-gnu
Thread model: posix
InstalledDir: /usr/lib/llvm/14/bin
/usr/lib/llvm/14
14.0.0
Python 3.9.12
Available Ruby profiles:
  [1]   ruby26 (with Rubygems)
  [2]   ruby27 (with Rubygems)
  [3]   ruby31 (with Rubygems) *
Available Rust versions:
  [1]   rust-bin-1.59.0
  [2]   rust-1.59.0 *
The following VMs are available for generation-2:
*)	Eclipse Temurin JDK 11.0.14_p9 [openjdk-bin-11]
2)	Eclipse Temurin JDK 8.322_p06 [openjdk-bin-8]
Available Java Virtual Machines:
  [1]   openjdk-bin-8 
  [2]   openjdk-bin-11  system-vm

The Glorious Glasgow Haskell Compilation System, version 8.10.4
php cli:
  [1]   php7.4
  [2]   php8.0
  [3]   php8.1 *

  HEAD of ::gentoo
commit 484ce4a14f78dac6d6f9df74682b63a67fc5c7f2
Author: Repository mirror & CI <repomirrorci@gentoo.org>
Date:   Wed Apr 6 00:04:47 2022 +0000

    2022-04-06 00:04:46 UTC

emerge -qpvO dev-util/qbs
[ebuild  N    ] dev-util/qbs-1.19.1  USE="gui test -doc -examples"
Comment 1 Toralf Förster gentoo-dev 2022-04-06 07:20:00 UTC
Created attachment 768958 [details]
emerge-info.txt
Comment 2 Toralf Förster gentoo-dev 2022-04-06 07:20:01 UTC
Created attachment 768960 [details]
dev-util:qbs-1.19.1:20220406-004659.log.bz2
Comment 3 Toralf Förster gentoo-dev 2022-04-06 07:20:02 UTC
Created attachment 768962 [details]
emerge-history.txt.bz2
Comment 4 Toralf Förster gentoo-dev 2022-04-06 07:20:11 UTC
Created attachment 768964 [details]
environment
Comment 5 Toralf Förster gentoo-dev 2022-04-06 07:20:12 UTC
Created attachment 768966 [details]
etc.portage.tar.bz2
Comment 6 Toralf Förster gentoo-dev 2022-04-06 07:20:13 UTC
Created attachment 768968 [details]
temp.tar.bz2
Comment 7 Toralf Förster gentoo-dev 2022-04-06 07:20:24 UTC
The file size of ./files/tests.tar.bz2 is too big (32M) for an upload. For about 8 weeks the link http://tinderbox.zwiebeltoralf.de:31560/17.1_desktop_gnome_systemd-j4_test-20220327-230019/var/tmp/tb/issues/20220406-030336-dev-util_qbs-1.19.1/files/tests.tar.bz2 is valid.