Gentoo Websites Logo
Go to: Gentoo Home Documentation Forums Lists Bugs Planet Store Wiki Get Gentoo!
Bug 836440 - dev-python/oslo-concurrency-4.5.0-r1 fails tests
Summary: dev-python/oslo-concurrency-4.5.0-r1 fails tests
Status: CONFIRMED
Alias: None
Product: Gentoo Linux
Classification: Unclassified
Component: Current packages (show other bugs)
Hardware: All Linux
: Normal normal (vote)
Assignee: Arthur Zamarin
URL:
Whiteboard:
Keywords:
Depends on:
Blocks:
 
Reported: 2022-03-30 17:09 UTC by Jakov Smolić
Modified: 2022-05-28 14:32 UTC (History)
1 user (show)

See Also:
Package list:
Runtime testing required: ---


Attachments
build log (oslo,51.14 KB, text/plain)
2022-03-30 17:09 UTC, Jakov Smolić
Details

Note You need to log in before you can comment on or make changes to this bug.
Description Jakov Smolić archtester gentoo-dev 2022-03-30 17:09:38 UTC
Created attachment 768216 [details]
build log

======================================================================
ERROR: test_core_size (oslo_concurrency.tests.unit.test_processutils.PrlimitTestCase)
oslo_concurrency.tests.unit.test_processutils.PrlimitTestCase.test_core_size
----------------------------------------------------------------------
testtools.testresult.real._StringException: Traceback (most recent call last):
  File "/var/tmp/portage/dev-python/oslo-concurrency-4.5.0-r1/work/oslo.concurrency-4.5.0-python3_9/install/usr/lib/python3.9/site-packages/oslo_concurrency/tests/unit/test_processutils.py", line 864, in test_core_size
    self.check_limit(prlimit, 'RLIMIT_CORE', prlimit.core_file_size)
  File "/var/tmp/portage/dev-python/oslo-concurrency-4.5.0-r1/work/oslo.concurrency-4.5.0-python3_9/install/usr/lib/python3.9/site-packages/oslo_concurrency/tests/unit/test_processutils.py", line 853, in check_limit
    stdout, stderr = processutils.execute(*args, prlimit=prlimit)
  File "/var/tmp/portage/dev-python/oslo-concurrency-4.5.0-r1/work/oslo.concurrency-4.5.0-python3_9/install/usr/lib/python3.9/site-packages/oslo_concurrency/processutils.py", line 438, in execute
    raise ProcessExecutionError(exit_code=_returncode,
oslo_concurrency.processutils.ProcessExecutionError: Unexpected error while running command.
Command: /var/tmp/portage/dev-python/oslo-concurrency-4.5.0-r1/work/oslo.concurrency-4.5.0-python3_9/install/usr/bin/python3.9 -m oslo_concurrency.prlimit --core=1024 -- /var/tmp/portage/dev-python/oslo-concurrency-4.5.0-r1/work/oslo.concurrency-4.5.0-python3_9/install/usr/bin/python3.9 -c import resource;print(resource.getrlimit(resource.RLIMIT_CORE))
Exit code: 1
Stdout: ''
Stderr: 'python3.9 -m oslo_concurrency.prlimit: failed to set the CORE resource limit: not allowed to raise maximum limit\n'


----------------------------------------------------------------------
Ran 115 tests in 53.039s

FAILED (errors=1)
Unexpected error while running command.
Command: None
Exit code: -
Stdout: "Lo, praise of the prowess of people-kings\n        of spear-armed Danes, in days long sped,\n        we have heard, and what honor the athelings won!\n        Oft Scyld the Scefing from squadroned foes,\n        from many a tribe, the mead-bench tore,\n        awing the earls. Since erst he lay\n        friendless, a foundling, fate repaid him:\n        for he waxed under welkin, in wealth he throve,\n        till before him the folk, both far and near,\n        who house by the whale-path, heard his mandate,\n        gave him gifts: a good king he!\n        To him an heir was afterward born,\n        a son in his halls, whom heaven sent\n        to favor the folk, feeling their woe\n        that erst they had lacked an earl for leader\n        so long a while; the Lord endowed him,\n        the Wielder of Wonder, with world's renown."
Stderr: None
 * ERROR: dev-python/oslo-concurrency-4.5.0-r1::gentoo failed (test phase):
 *   Tests failed with python3.9
 * 
 * Call stack:
 *     ebuild.sh, line  127:  Called src_test
 *   environment, line 3119:  Called distutils-r1_src_test
 *   environment, line 1447:  Called _distutils-r1_run_foreach_impl 'python_test'
 *   environment, line  566:  Called python_foreach_impl 'distutils-r1_run_phase' 'python_test'
 *   environment, line 2795:  Called multibuild_foreach_variant '_python_multibuild_wrapper' 'distutils-r1_run_phase' 'python_test'
 *   environment, line 2337:  Called _multibuild_run '_python_multibuild_wrapper' 'distutils-r1_run_phase' 'python_test'
 *   environment, line 2335:  Called _python_multibuild_wrapper 'distutils-r1_run_phase' 'python_test'
 *   environment, line  899:  Called distutils-r1_run_phase 'python_test'
 *   environment, line 1374:  Called python_test
 *   environment, line 3086:  Called eunittest
 *   environment, line 1889:  Called die
 * The specific snippet of code:
 *       "${@}" || die -n "Tests failed with ${EPYTHON}";
 * 
 * If you need support, post the output of `emerge --info '=dev-python/oslo-concurrency-4.5.0-r1::gentoo'`,
 * the complete build log and the output of `emerge -pqv '=dev-python/oslo-concurrency-4.5.0-r1::gentoo'`.
 * The complete build log is located at '/var/log/portage/dev-python:oslo-concurrency-4.5.0-r1:20220330-162747.log'.
 * For convenience, a symlink to the build log is located at '/var/tmp/portage/dev-python/oslo-concurrency-4.5.0-r1/temp/build.log'.
 * The ebuild environment file is located at '/var/tmp/portage/dev-python/oslo-concurrency-4.5.0-r1/temp/environment'.
 * Working directory: '/var/tmp/portage/dev-python/oslo-concurrency-4.5.0-r1/work/oslo.concurrency-4.5.0-python3_9/install/usr/lib/python3.9/site-packages'
 * S: '/var/tmp/portage/dev-python/oslo-concurrency-4.5.0-r1/work/oslo.concurrency-4.5.0'
Comment 1 Jakov Smolić archtester gentoo-dev 2022-03-30 17:09:53 UTC
Portage 3.0.30 (python 3.9.10-final-0, default/linux/riscv/20.0/rv64gc/lp64d/systemd, gcc-11.2.1, glibc-2.34-r9, 5.15.23-riscv64 riscv64)
=================================================================
System uname: Linux-5.15.23-riscv64-riscv64-with-glibc2.34
KiB Mem:    16376576 total,   9568012 free
KiB Swap:          0 total,         0 free
Timestamp of repository gentoo: Wed, 30 Mar 2022 07:34:47 +0000
sh bash 5.1_p16
ld GNU ld (Gentoo 2.37_p1 p2) 2.37
app-misc/pax-utils:        1.3.3::gentoo
app-shells/bash:           5.1_p16::gentoo
dev-lang/perl:             5.34.0-r8::gentoo
dev-lang/python:           3.9.10-r1::gentoo, 3.10.2-r1::gentoo
dev-util/cmake:            3.22.2::gentoo
dev-util/meson:            0.61.1::gentoo
sys-apps/baselayout:       2.8::gentoo
sys-apps/sandbox:          2.29::gentoo
sys-apps/systemd:          250.4::gentoo
sys-devel/autoconf:        2.71-r1::gentoo
sys-devel/automake:        1.16.5::gentoo
sys-devel/binutils:        2.37_p1-r2::gentoo
sys-devel/binutils-config: 5.4.1::gentoo
sys-devel/gcc:             11.2.1_p20220115::gentoo
sys-devel/gcc-config:      2.5-r1::gentoo
sys-devel/libtool:         2.4.6-r6::gentoo
sys-devel/make:            4.3::gentoo
sys-kernel/linux-headers:  5.16::gentoo (virtual/os-headers)
sys-libs/glibc:            2.34-r9::gentoo
Repositories:

gentoo
    location: /var/db/repos/gentoo
    sync-type: rsync
    sync-uri: rsync://rsync.gentoo.org/gentoo-portage
    priority: -1000
    sync-rsync-verify-jobs: 1
    sync-rsync-verify-metamanifest: yes
    sync-rsync-extra-opts:
    sync-rsync-verify-max-age: 24

ACCEPT_KEYWORDS="riscv ~riscv"
ACCEPT_LICENSE="* -@EULA"
CBUILD="riscv64-unknown-linux-gnu"
CFLAGS="-O2 -pipe"
CHOST="riscv64-unknown-linux-gnu"
CONFIG_PROTECT="/etc /usr/share/gnupg/qualified.txt"
CONFIG_PROTECT_MASK="/etc/ca-certificates.conf /etc/env.d /etc/fonts/fonts.conf /etc/gconf /etc/gentoo-release /etc/revdep-rebuild /etc/sandbox.d /etc/terminfo"
CXXFLAGS="-O2 -pipe"
DISTDIR="/var/cache/distfiles"
EMERGE_DEFAULT_OPTS="--jobs 3 --load-average 10"
ENV_UNSET="CARGO_HOME DBUS_SESSION_BUS_ADDRESS DISPLAY GOBIN GOPATH PERL5LIB PERL5OPT PERLPREFIX PERL_CORE PERL_MB_OPT PERL_MM_OPT XAUTHORITY XDG_CACHE_HOME XDG_CONFIG_HOME XDG_DATA_HOME XDG_RUNTIME_DIR"
FCFLAGS="-O2 -pipe"
FEATURES="assume-digests binpkg-docompress binpkg-dostrip binpkg-logs buildpkg-live config-protect-if-modified distlocks ebuild-locks fixlafiles merge-sync multilib-strict news parallel-fetch preserve-libs protect-owned qa-unresolved-soname-deps sandbox sfperms strict unknown-features-warn unmerge-logs unmerge-orphans userfetch userpriv usersandbox usersync xattr"
FFLAGS="-O2 -pipe"
GENTOO_MIRRORS="         http://mirrors.163.com/gentoo         https://mirrors.tuna.tsinghua.edu.cn/gentoo         http://ftp.jaist.ac.jp/pub/Linux/Gentoo/ "
LANG="C.UTF8"
LDFLAGS="-Wl,-O1 -Wl,--as-needed"
MAKEOPTS="-j6"
PKGDIR="/var/cache/binpkgs"
PORTAGE_CONFIGROOT="/"
PORTAGE_RSYNC_OPTS="--recursive --links --safe-links --perms --times --omit-dir-times --compress --force --whole-file --delete --stats --human-readable --timeout=180 --exclude=/distfiles --exclude=/local --exclude=/packages --exclude=/.git"
PORTAGE_TMPDIR="/var/tmp"
SHELL="/bin/bash"
USE="acl bzip2 cli crypt dri fortran gdbm iconv ipv6 libglvnd ncurses nls nptl openmp pam pcre readline riscv seccomp split-usr ssl systemd udev unicode xattr zlib" ADA_TARGET="gnat_2020" APACHE2_MODULES="authn_core authz_core socache_shmcb unixd actions alias auth_basic authn_alias authn_anon authn_dbm authn_default authn_file authz_dbm authz_default authz_groupfile authz_host authz_owner authz_user autoindex cache cgi cgid dav dav_fs dav_lock deflate dir disk_cache env expires ext_filter file_cache filter headers include info log_config logio mem_cache mime mime_magic negotiation rewrite setenvif speling status unique_id userdir usertrack vhost_alias" CALLIGRA_FEATURES="karbon sheets words" COLLECTD_PLUGINS="df interface irq load memory rrdtool swap syslog" ELIBC="glibc" GPSD_PROTOCOLS="ashtech aivdm earthmate evermore fv18 garmin garmintxt gpsclock greis isync itrax mtk3301 nmea ntrip navcom oceanserver oldstyle oncore rtcm104v2 rtcm104v3 sirf skytraq superstar2 timing tsip tripmate tnt ublox ubx" INPUT_DEVICES="libinput" KERNEL="linux" LCD_DEVICES="bayrad cfontz cfontz633 glk hd44780 lb216 lcdm001 mtxorb ncurses text" LIBREOFFICE_EXTENSIONS="presenter-console presenter-minimizer" LUA_SINGLE_TARGET="lua5-1" LUA_TARGETS="lua5-1" OFFICE_IMPLEMENTATION="libreoffice" PHP_TARGETS="php7-4 php8-0" POSTGRES_TARGETS="postgres12 postgres13" PYTHON_SINGLE_TARGET="python3_9" PYTHON_TARGETS="python3_9" RUBY_TARGETS="ruby26 ruby27" USERLAND="GNU" VIDEO_CARDS="fbdev v4l" XTABLES_ADDONS="quota2 psd pknock lscan length2 ipv4options ipset ipp2p iface geoip fuzzy condition tee tarpit sysrq proto steal rawnat logmark ipmark dhcpmac delude chaos account"
Unset:  ADDR2LINE, AR, ARFLAGS, AS, ASFLAGS, CC, CCLD, CONFIG_SHELL, CPP, CPPFLAGS, CTARGET, CXX, CXXFILT, ELFEDIT, EXTRA_ECONF, F77FLAGS, FC, GCOV, GPROF, INSTALL_MASK, LC_ALL, LD, LEX, LFLAGS, LIBTOOL, LINGUAS, MAKE, MAKEFLAGS, NM, OBJCOPY, OBJDUMP, PORTAGE_BINHOST, PORTAGE_BUNZIP2_COMMAND, PORTAGE_COMPRESS, PORTAGE_COMPRESS_FLAGS, PORTAGE_RSYNC_EXTRA_OPTS, RANLIB, READELF, RUSTFLAGS, SIZE, STRINGS, STRIP, YACC, YFLAGS