Gentoo Websites Logo
Go to: Gentoo Home Documentation Forums Lists Bugs Planet Store Wiki Get Gentoo!
Bug 832839 - dev-python/pytest-check-1.0.4: fails tests
Summary: dev-python/pytest-check-1.0.4: fails tests
Status: RESOLVED FIXED
Alias: None
Product: Gentoo Linux
Classification: Unclassified
Component: Current packages (show other bugs)
Hardware: All Linux
: Normal normal (vote)
Assignee: Arthur Zamarin
URL:
Whiteboard:
Keywords: TESTFAILURE
Depends on:
Blocks: 831852
  Show dependency tree
 
Reported: 2022-02-07 08:43 UTC by Sam James
Modified: 2022-02-07 20:14 UTC (History)
0 users

See Also:
Package list:
Runtime testing required: ---


Attachments
build.log (file_832839.txt,49.39 KB, text/plain)
2022-02-07 08:43 UTC, Sam James
Details

Note You need to log in before you can comment on or make changes to this bug.
Description Sam James archtester Gentoo Infrastructure gentoo-dev Security 2022-02-07 08:43:23 UTC
Created attachment 764506 [details]
build.log

============================================================================ warnings summary =============================================================================
../../../../../../../../../usr/lib/python3.9/site-packages/pytest_asyncio/plugin.py:191
  /usr/lib/python3.9/site-packages/pytest_asyncio/plugin.py:191: DeprecationWarning: The 'asyncio_mode' default value will change to 'strict' in future, please explicitly use 'asyncio_mode=strict' or 'asyncio_mode=auto' in pytest configuration file.
    config.issue_config_time_warning(LEGACY_MODE, stacklevel=2)

-- Docs: https://docs.pytest.org/en/stable/warnings.html
========================================================================= short test summary info =========================================================================
FAILED test_check_and_assert.py::test_fail_check
FAILED test_check_and_assert.py::test_fail_assert - assert 1 == 2
====================================================================== 2 failed, 1 warning in 0.21s =======================================================================
============================================================================ warnings summary =============================================================================
../../../../../../../usr/lib/python3.9/site-packages/pytest_asyncio/plugin.py:191
  /usr/lib/python3.9/site-packages/pytest_asyncio/plugin.py:191: DeprecationWarning: The 'asyncio_mode' default value will change to 'strict' in future, please explicitly use 'asyncio_mode=strict' or 'asyncio_mode=auto' in pytest configuration file.
    config.issue_config_time_warning(LEGACY_MODE, stacklevel=2)

-- Docs: https://docs.pytest.org/en/stable/warnings.html
========================================================================= short test summary info =========================================================================
FAILED tests/test_check.py::test_check_xfail - Failed: nomatch: '* 1 xfailed *'
FAILED tests/test_check.py::test_check_xfail_strict - Failed: nomatch: '* 1 xfailed *'
FAILED tests/test_check.py::test_check_xpassed - Failed: nomatch: '* 1 xpassed *'
FAILED tests/test_check.py::test_check_xpassed_strict - Failed: nomatch: '* 1 failed *'
FAILED tests/test_check.py::test_check_and_assert - Failed: nomatch: '* 2 failed *'
================================================================ 5 failed, 35 passed, 1 warning in 19.44s =================================================================
 * ERROR: dev-python/pytest-check-1.0.4::gentoo failed (test phase):
 *   pytest failed with python3.9
 * 

----
# emerge --info
!!! It seems /run is not mounted. Process management may malfunction.
Portage 3.0.29 (python 3.9.9-final-0, default/linux/ia64/17.0, gcc-11.2.1, glibc-2.34-r3, 5.13.0-00002-gdecb01746d6c ia64)
=================================================================
System uname: Linux-5.13.0-00002-gdecb01746d6c-ia64-Dual-Core_Intel-R-_Itanium-R-_Processor_9040-with-glibc2.34
KiB Mem:    16563904 total,   8192528 free
KiB Swap:    1999184 total,   1928896 free
Timestamp of repository gentoo: Mon, 07 Feb 2022 03:30:01 +0000
Head commit of repository gentoo: d0b1a5cbfebe50ca1267f4b8ce1d93f1cb8ee522
sh bash 5.1_p12
ld GNU ld (Gentoo 2.37_p1 p1) 2.37
app-misc/pax-utils:        1.3.3::gentoo
app-shells/bash:           5.1_p12::gentoo
dev-lang/perl:             5.34.0-r5::gentoo
dev-lang/python:           2.7.18_p13::gentoo, 3.9.9-r1::gentoo, 3.10.1::gentoo
dev-util/cmake:            3.22.1::gentoo
dev-util/meson:            0.60.2-r1::gentoo
sys-apps/baselayout:       2.8::gentoo
sys-apps/openrc:           0.44.9::gentoo
sys-apps/sandbox:          2.29::gentoo
sys-devel/autoconf:        2.13-r1::gentoo, 2.71-r1::gentoo
sys-devel/automake:        1.16.5::gentoo
sys-devel/binutils:        2.37_p1-r1::gentoo
sys-devel/binutils-config: 5.4::gentoo
sys-devel/gcc:             11.2.1_p20211127::gentoo
sys-devel/gcc-config:      2.5-r1::gentoo
sys-devel/libtool:         2.4.6-r6::gentoo
sys-devel/make:            4.3::gentoo
sys-kernel/linux-headers:  5.15-r1::gentoo (virtual/os-headers)
sys-libs/glibc:            2.34-r3::gentoo
Repositories:

gentoo
    location: /bound/portage
    sync-type: rsync
    sync-uri: rsync://rsync.gentoo.org/gentoo-portage
    priority: -1000
    sync-rsync-extra-opts: 
    sync-rsync-verify-max-age: 24
    sync-rsync-verify-jobs: 1
    sync-rsync-verify-metamanifest: yes

ACCEPT_KEYWORDS="ia64 ~ia64"
ACCEPT_LICENSE="@FREE"
CBUILD="ia64-unknown-linux-gnu"
CFLAGS="-O2 -pipe -fdiagnostics-show-option -frecord-gcc-switches"
CHOST="ia64-unknown-linux-gnu"
CONFIG_PROTECT="/etc /usr/share/gnupg/qualified.txt"
CONFIG_PROTECT_MASK="/etc/ca-certificates.conf /etc/env.d /etc/fonts/fonts.conf /etc/gconf /etc/gentoo-release /etc/revdep-rebuild /etc/sandbox.d /etc/terminfo /etc/texmf/language.dat.d /etc/texmf/language.def.d /etc/texmf/updmap.d /etc/texmf/web2c"
CXXFLAGS="-O2 -pipe"
DISTDIR="/bound/distfiles"
EMERGE_DEFAULT_OPTS="--keep-going=y --deep --complete-graph --with-bdeps=y"
ENV_UNSET="CARGO_HOME DBUS_SESSION_BUS_ADDRESS DISPLAY GOBIN GOPATH PERL5LIB PERL5OPT PERLPREFIX PERL_CORE PERL_MB_OPT PERL_MM_OPT XAUTHORITY XDG_CACHE_HOME XDG_CONFIG_HOME XDG_DATA_HOME XDG_RUNTIME_DIR"
FCFLAGS="-O2 -pipe"
FEATURES="assume-digests binpkg-docompress binpkg-dostrip binpkg-logs buildpkg-live config-protect-if-modified distlocks ebuild-locks fixlafiles ipc-sandbox merge-sync multilib-strict network-sandbox news parallel-fetch pid-sandbox preserve-libs protect-owned qa-unresolved-soname-deps sandbox sfperms strict unknown-features-warn unmerge-logs unmerge-orphans userfetch userpriv usersandbox usersync xattr"
FFLAGS="-O2 -pipe"
GENTOO_MIRRORS="http://distfiles.gentoo.org"
LANG="C.UTF8"
LDFLAGS="-Wl,-O1 -Wl,--as-needed -Wl,--hash-style=gnu"
MAKEOPTS="-j5 -l5"
PKGDIR="/var/cache/binpkgs"
PORTAGE_CONFIGROOT="/"
PORTAGE_RSYNC_OPTS="--recursive --links --safe-links --perms --times --omit-dir-times --compress --force --whole-file --delete --stats --human-readable --timeout=180 --exclude=/distfiles --exclude=/local --exclude=/packages --exclude=/.git"
PORTAGE_TMPDIR="/var/tmp"
SHELL="/bin/bash"
USE="acl bzip2 cli crypt dri elogind fortran gdbm ia64 iconv ipv6 libglvnd libtirpc ncurses nls nptl openmp pam pcre readline split-usr ssl unicode xattr zlib" ADA_TARGET="gnat_2020" APACHE2_MODULES="authn_core authz_core socache_shmcb unixd actions alias auth_basic authn_alias authn_anon authn_dbm authn_default authn_file authz_dbm authz_default authz_groupfile authz_host authz_owner authz_user autoindex cache cgi cgid dav dav_fs dav_lock deflate dir disk_cache env expires ext_filter file_cache filter headers include info log_config logio mem_cache mime mime_magic negotiation rewrite setenvif speling status unique_id userdir usertrack vhost_alias" CALLIGRA_FEATURES="karbon sheets words" COLLECTD_PLUGINS="df interface irq load memory rrdtool swap syslog" ELIBC="glibc" GPSD_PROTOCOLS="ashtech aivdm earthmate evermore fv18 garmin garmintxt gpsclock greis isync itrax mtk3301 nmea ntrip navcom oceanserver oldstyle oncore rtcm104v2 rtcm104v3 sirf skytraq superstar2 timing tsip tripmate tnt ublox ubx" INPUT_DEVICES="void libinput" KERNEL="linux" LCD_DEVICES="bayrad cfontz cfontz633 glk hd44780 lb216 lcdm001 mtxorb ncurses text" LIBREOFFICE_EXTENSIONS="presenter-console presenter-minimizer" LUA_SINGLE_TARGET="lua5-1" LUA_TARGETS="lua5-1" OFFICE_IMPLEMENTATION="libreoffice" PHP_TARGETS="php7-4 php8-0" POSTGRES_TARGETS="postgres12 postgres13" PYTHON_SINGLE_TARGET="python3_9" PYTHON_TARGETS="python3_9" RUBY_TARGETS="ruby26 ruby27" USERLAND="GNU" VIDEO_CARDS="dummy fbdev v4l" XTABLES_ADDONS="quota2 psd pknock lscan length2 ipv4options ipset ipp2p iface geoip fuzzy condition tee tarpit sysrq proto steal rawnat logmark ipmark dhcpmac delude chaos account"
Unset:  ADDR2LINE, AR, ARFLAGS, AS, ASFLAGS, CC, CCLD, CONFIG_SHELL, CPP, CPPFLAGS, CTARGET, CXX, CXXFILT, ELFEDIT, EXTRA_ECONF, F77FLAGS, FC, GCOV, GPROF, INSTALL_MASK, LC_ALL, LD, LEX, LFLAGS, LIBTOOL, LINGUAS, MAKE, MAKEFLAGS, NM, OBJCOPY, OBJDUMP, PORTAGE_BINHOST, PORTAGE_BUNZIP2_COMMAND, PORTAGE_COMPRESS, PORTAGE_COMPRESS_FLAGS, PORTAGE_RSYNC_EXTRA_OPTS, RANLIB, READELF, RUSTFLAGS, SIZE, STRINGS, STRIP, YACC, YFLAGS
Comment 1 Arthur Zamarin archtester gentoo-dev 2022-02-07 19:24:19 UTC
Found the issue - originates in the fact that it was expecting only xfail without a warning, but because of new deprecation of pytest, there exist a warning which we can skip.
Comment 2 Larry the Git Cow gentoo-dev 2022-02-07 20:14:57 UTC
The bug has been closed via the following commit(s):

https://gitweb.gentoo.org/repo/gentoo.git/commit/?id=5ddbf0691e2d6410b79bc9e353b458c490457bbb

commit 5ddbf0691e2d6410b79bc9e353b458c490457bbb
Author:     Arthur Zamarin <arthurzam@gentoo.org>
AuthorDate: 2022-02-07 20:13:11 +0000
Commit:     Arthur Zamarin <arthurzam@gentoo.org>
CommitDate: 2022-02-07 20:14:37 +0000

    dev-python/pytest-check: fix tests with newer pytest-asyncio
    
    Closes: https://bugs.gentoo.org/832839
    Signed-off-by: Arthur Zamarin <arthurzam@gentoo.org>

 dev-python/pytest-check/pytest-check-1.0.4.ebuild | 10 ++++++++--
 1 file changed, 8 insertions(+), 2 deletions(-)