Gentoo Websites Logo
Go to: Gentoo Home Documentation Forums Lists Bugs Planet Store Wiki Get Gentoo!
Bug 790581 - sys-apps/attr-2.5.1: fails test/attr.test test on ppc
Summary: sys-apps/attr-2.5.1: fails test/attr.test test on ppc
Status: CONFIRMED
Alias: None
Product: Gentoo Linux
Classification: Unclassified
Component: Current packages (show other bugs)
Hardware: All Linux
: Normal normal (vote)
Assignee: Gentoo's Team for Core System packages
URL:
Whiteboard:
Keywords: TESTFAILURE
Depends on:
Blocks:
 
Reported: 2021-05-16 20:31 UTC by Sam James
Modified: 2021-05-16 20:33 UTC (History)
0 users

See Also:
Package list:
Runtime testing required: ---


Attachments
build.log (file_790581.txt,30.37 KB, text/plain)
2021-05-16 20:31 UTC, Sam James
Details
test-suite.log (file_790581.txt,17.94 KB, text/plain)
2021-05-16 20:32 UTC, Sam James
Details

Note You need to log in before you can comment on or make changes to this bug.
Description Sam James archtester Gentoo Infrastructure gentoo-dev Security 2021-05-16 20:31:52 UTC
Created attachment 709191 [details]
build.log

make[3]: Entering directory '/var/tmp/portage/sys-apps/attr-2.5.1/work/attr-2.5.1-.ppc'
FAIL: test/attr.test
SKIP: test/root/getfattr.test
============================================================================
Testsuite summary for attr 2.5.1
============================================================================
# TOTAL: 2
# PASS:  0
# SKIP:  1
# XFAIL: 0
# FAIL:  1
# XPASS: 0
# ERROR: 0
============================================================================
See ./test-suite.log
Please report to acl-devel@nongnu.org
============================================================================
make[3]: *** [Makefile:1344: test-suite.log] Error 1
make[3]: Leaving directory '/var/tmp/portage/sys-apps/attr-2.5.1/work/attr-2.5.1-.ppc'
make[2]: *** [Makefile:1452: check-TESTS] Error 2
make[2]: Leaving directory '/var/tmp/portage/sys-apps/attr-2.5.1/work/attr-2.5.1-.ppc'
make[1]: *** [Makefile:1675: check-am] Error 2
make[1]: Leaving directory '/var/tmp/portage/sys-apps/attr-2.5.1/work/attr-2.5.1-.ppc'
make: *** [Makefile:1229: check-recursive] Error 1
 * ERROR: sys-apps/attr-2.5.1::gentoo failed (test phase):
 *   Make check failed. See above for details.

----
Portage 3.0.18 (python 3.9.4-final-0, default/linux/powerpc/ppc32/17.0/desktop, gcc-10.2.0, glibc-2.32-r7, 5.4.72-gentoo ppc)
=================================================================
System uname: Linux-5.4.72-gentoo-ppc-POWER8_-architected-,_altivec_supported-with-glibc2.32
KiB Mem:    24699464 total,  12335812 free
KiB Swap:   25165820 total,  23818192 free
Timestamp of repository gentoo: Sun, 16 May 2021 19:50:16 +0000
sh bash 5.1_p8
ld GNU ld (Gentoo 2.34 p6) 2.34.0
app-shells/bash:          5.1_p8::gentoo
dev-lang/perl:            5.30.3::gentoo
dev-lang/python:          2.7.18_p9::gentoo, 3.6.13_p3::gentoo, 3.7.10_p3::gentoo, 3.8.9_p2::gentoo, 3.9.4_p1::gentoo
dev-util/cmake:           3.18.5::gentoo
sys-apps/baselayout:      2.7::gentoo
sys-apps/openrc:          0.42.1-r1::gentoo
sys-apps/sandbox:         2.23::gentoo
sys-devel/autoconf:       2.13-r1::gentoo, 2.69-r5::gentoo
sys-devel/automake:       1.16.2-r1::gentoo
sys-devel/binutils:       2.34-r2::gentoo, 2.35.2::gentoo
sys-devel/gcc:            10.2.0-r5::gentoo
sys-devel/gcc-config:     2.4::gentoo
sys-devel/libtool:        2.4.6-r6::gentoo
sys-devel/make:           4.3::gentoo
sys-kernel/linux-headers: 5.10::gentoo (virtual/os-headers)
sys-libs/glibc:           2.32-r7::gentoo
Repositories:

gentoo
    location: /var/db/repos/gentoo
    sync-type: rsync
    sync-uri: rsync://rsync.gentoo.org/gentoo-portage
    priority: -1000
    sync-rsync-extra-opts:
    sync-rsync-verify-metamanifest: yes
    sync-rsync-verify-max-age: 24
    sync-rsync-verify-jobs: 1

ACCEPT_KEYWORDS="ppc"
ACCEPT_LICENSE="*"
CBUILD="powerpc-unknown-linux-gnu"
CFLAGS="-O2 -mcpu=powerpc -mtune=powerpc -pipe -frecord-gcc-switches -fdiagnostics-show-option"
CHOST="powerpc-unknown-linux-gnu"
CONFIG_PROTECT="/etc /etc/stunnel/stunnel.conf /usr/share/gnupg/qualified.txt /var/qmail/alias /var/qmail/control /var/vpopmail/etc"
CONFIG_PROTECT_MASK="/etc/ca-certificates.conf /etc/dconf /etc/env.d /etc/fonts/fonts.conf /etc/gconf /etc/gentoo-release /etc/php/apache2-php7.3/ext-active/ /etc/php/apache2-php7.4/ext-active/ /etc/php/cgi-php7.3/ext-active/ /etc/php/cgi-php7.4/ext-active/ /etc/php/cli-php7.3/ext-active/ /etc/php/cli-php7.4/ext-active/ /etc/revdep-rebuild /etc/sandbox.d /etc/terminfo /etc/texmf/language.dat.d /etc/texmf/language.def.d /etc/texmf/updmap.d /etc/texmf/web2c"
CXXFLAGS="-O2 -mcpu=powerpc -mtune=powerpc -pipe -frecord-gcc-switches -fdiagnostics-show-option"
DISTDIR="/var/cache/distfiles"
EMERGE_DEFAULT_OPTS="--nospinner --ask-enter-invalid --jobs=4 --load-average 10 --quiet-build --keep-going --complete-graph --with-bdeps=y --deep"
ENV_UNSET="CARGO_HOME DBUS_SESSION_BUS_ADDRESS DISPLAY GOBIN GOPATH PERL5LIB PERL5OPT PERLPREFIX PERL_CORE PERL_MB_OPT PERL_MM_OPT XAUTHORITY XDG_CACHE_HOME XDG_CONFIG_HOME XDG_DATA_HOME XDG_RUNTIME_DIR"
FCFLAGS="-O2 -mcpu=powerpc -mtune=powerpc -pipe -frecord-gcc-switches -fdiagnostics-show-option"
FEATURES="assume-digests binpkg-docompress binpkg-dostrip binpkg-logs cgroup config-protect-if-modified distlocks ebuild-locks fixlafiles ipc-sandbox mount-sandbox multilib-strict network-sandbox news parallel-fetch parallel-install pid-sandbox preserve-libs protect-owned qa-unresolved-soname-deps sandbox sfperms strict unknown-features-warn unmerge-logs unmerge-orphans userfetch userpriv usersandbox usersync xattr"
FFLAGS="-O2 -mcpu=powerpc -mtune=powerpc -pipe -frecord-gcc-switches -fdiagnostics-show-option"
GENTOO_MIRRORS="https://gentoo.osuosl.org/"
LANG="C.UTF8"
LDFLAGS="-Wl,-O1 -Wl,--as-needed -Wl,--defsym=__gentoo_check_ldflags__=0"
MAKEOPTS="-j12 -l10"
PKGDIR="/var/tmp/portage/ppc32"
PORTAGE_CONFIGROOT="/"
PORTAGE_RSYNC_OPTS="--recursive --links --safe-links --perms --times --omit-dir-times --compress --force --whole-file --delete --stats --human-readable --timeout=180 --exclude=/distfiles --exclude=/local --exclude=/packages --exclude=/.git"
PORTAGE_TMPDIR="/var/tmp"
USE="X a52 aac acl alsa berkdb big-endian bluetooth branding bzip2 cairo cdda cdr cli crypt cups dbus dri dts dvd dvdr elogind emboss encode exif flac fortran gdbm gif gpm gtk gui iconv icu ipv6 jpeg lcms libglvnd libnotify mad mng mp3 mp4 mpeg ncurses nls nptl ogg opengl openmp pam pango pcre pdf png polkit ppc ppds qt5 readline sdl seccomp spell split-usr ssl startup-notification svg tcpd tiff truetype udev udisks unicode upower usb vorbis wxwidgets x264 xattr xcb xml xv xvid zlib" ABI_PPC="32" ADA_TARGET="gnat_2018" ALSA_CARDS="aoa aoa-fabric-layout aoa-onyx aoa-soundbus aoa-soundbus-i2s aoa-tas aoa-toonie powermac usb-audio via82xx" APACHE2_MODULES="authn_core authz_core socache_shmcb unixd actions alias auth_basic authn_alias authn_anon authn_dbm authn_default authn_file authz_dbm authz_default authz_groupfile authz_host authz_owner authz_user autoindex cache cgi cgid dav dav_fs dav_lock deflate dir disk_cache env expires ext_filter file_cache filter headers include info log_config logio mem_cache mime mime_magic negotiation rewrite setenvif speling status unique_id userdir usertrack vhost_alias" CALLIGRA_FEATURES="karbon sheets words" COLLECTD_PLUGINS="df interface irq load memory rrdtool swap syslog" ELIBC="glibc" GPSD_PROTOCOLS="ashtech aivdm earthmate evermore fv18 garmin garmintxt gpsclock greis isync itrax mtk3301 nmea ntrip navcom oceanserver oldstyle oncore rtcm104v2 rtcm104v3 sirf skytraq superstar2 timing tsip tripmate tnt ublox ubx" INPUT_DEVICES="libinput" KERNEL="linux" LCD_DEVICES="bayrad cfontz cfontz633 glk hd44780 lb216 lcdm001 mtxorb ncurses text" LIBREOFFICE_EXTENSIONS="presenter-console presenter-minimizer" LUA_SINGLE_TARGET="lua5-1" LUA_TARGETS="lua5-1" OFFICE_IMPLEMENTATION="libreoffice" PHP_TARGETS="php7-3 php7-4" POSTGRES_TARGETS="postgres10 postgres11" PYTHON_SINGLE_TARGET="python3_8" PYTHON_TARGETS="python3_8 python3_9" RUBY_TARGETS="ruby26" USERLAND="GNU" VIDEO_CARDS="fbdev glint mga nv r128 radeon dummy v4l" XTABLES_ADDONS="quota2 psd pknock lscan length2 ipv4options ipset ipp2p iface geoip fuzzy condition tee tarpit sysrq proto steal rawnat logmark ipmark dhcpmac delude chaos account"
Unset:  CC, CPPFLAGS, CTARGET, CXX, INSTALL_MASK, LC_ALL, LINGUAS, PORTAGE_BINHOST, PORTAGE_BUNZIP2_COMMAND, PORTAGE_COMPRESS, PORTAGE_COMPRESS_FLAGS, PORTAGE_RSYNC_EXTRA_OPTS, RUSTFLAGS
Comment 1 Sam James archtester Gentoo Infrastructure gentoo-dev Security 2021-05-16 20:32:08 UTC
Created attachment 709194 [details]
test-suite.log
Comment 2 Sam James archtester Gentoo Infrastructure gentoo-dev Security 2021-05-16 20:33:42 UTC
Note that 2.4.48 fails in the same way so not a regression. I assume this is an environmental thing rather than something fundamental to ppc given the "operation not supported" errors.