Gentoo Websites Logo
Go to: Gentoo Home Documentation Forums Lists Bugs Planet Store Wiki Get Gentoo!
Bug 775107 - games-emulation/advancemame-3.9 - parallel build issues (with more than -j1)
Summary: games-emulation/advancemame-3.9 - parallel build issues (with more than -j1)
Status: UNCONFIRMED
Alias: None
Product: Gentoo Linux
Classification: Unclassified
Component: Current packages (show other bugs)
Hardware: All Linux
: Normal normal (vote)
Assignee: Gentoo Games
URL:
Whiteboard:
Keywords:
Depends on:
Blocks: parallel-make
  Show dependency tree
 
Reported: 2021-03-09 18:44 UTC by ernsteiswuerfel
Modified: 2021-11-20 11:31 UTC (History)
1 user (show)

See Also:
Package list:
Runtime testing required: ---


Attachments
build.log (advancemame-3.9:20210309-140124.log,16.87 KB, text/plain)
2021-03-09 18:44 UTC, ernsteiswuerfel
Details
emerge --info (file_775107.txt,5.75 KB, text/plain)
2021-03-09 18:45 UTC, ernsteiswuerfel
Details

Note You need to log in before you can comment on or make changes to this bug.
Description ernsteiswuerfel archtester 2021-03-09 18:44:32 UTC
Created attachment 690306 [details]
build.log

tatt-tests show build failures:

 # cat advancemame-769962.report 
USE tests started on Di 9. Mär 15:00:58 CET 2021

 FEATURES=' test' failed for =games-emulation/advancemame-3.9
USE='alsa -fbcon ncurses -oss -slang -truetype' failed for =games-emulation/advancemame-3.9
USE='alsa fbcon -ncurses oss -slang -truetype' failed for =games-emulation/advancemame-3.9
USE='alsa fbcon -ncurses -oss -slang truetype' failed for =games-emulation/advancemame-3.9
USE='-alsa -fbcon ncurses -oss -slang truetype' succeeded for =games-emulation/advancemame-3.9
USE='-alsa fbcon ncurses -oss -slang truetype' failed for =games-emulation/advancemame-3.9
USE='alsa fbcon -ncurses oss -slang truetype' failed for =games-emulation/advancemame-3.9
USE='alsa -fbcon ncurses oss -slang truetype' failed for =games-emulation/advancemame-3.9
USE='alsa -fbcon -ncurses -oss slang truetype' failed for =games-emulation/advancemame-3.9
USE='alsa fbcon -ncurses -oss slang truetype' failed for =games-emulation/advancemame-3.9
USE='-alsa fbcon -ncurses oss slang truetype' failed for =games-emulation/advancemame-3.9
USE='-alsa -fbcon ncurses oss slang truetype' succeeded for =games-emulation/advancemame-3.9
USE='alsa fbcon ncurses oss slang truetype' succeeded for =games-emulation/advancemame-3.9

I get build failures like these:
[...]
Assembler messages:
Fatal error: can't create obj/mame/linux/blend/advance/linux/os.o: No such file or directory
Assembler messages:
Fatal error: can't create obj/mame/linux/blend/advance/linux/target.o: No such file or directory
Assembler messages:
Fatal error: can't create obj/mame/linux/blend/advance/lib/lcd.o: No such file or directory
Assembler messages:
Fatal error: can't create obj/mame/linux/blend/advance/osd/thdouble.o: No such file or directory
make: *** [advance/emu.mak:571: obj/mame/linux/blend/advance/lib/lcd.o] Error 2
make: *** Waiting for unfinished jobs....
make: *** [advance/emu.mak:567: obj/mame/linux/blend/advance/osd/thdouble.o] Error 2
make: *** [advance/emu.mak:571: obj/mame/linux/blend/advance/linux/target.o] Error 2
make: *** [advance/emu.mak:571: obj/mame/linux/blend/advance/linux/os.o] Error 2
 * ERROR: games-emulation/advancemame-3.9::gentoo failed (compile phase):


But when built with MAKEOPTS="-j1" the failed builds just build fine.
Comment 1 ernsteiswuerfel archtester 2021-03-09 18:45:05 UTC
Created attachment 690309 [details]
emerge --info