Gentoo Websites Logo
Go to: Gentoo Home Documentation Forums Lists Bugs Planet Store Wiki Get Gentoo!
Bug 73528 - emerge kde 2> textInDetails
Summary: emerge kde 2> textInDetails
Alias: None
Product: Gentoo Linux
Classification: Unclassified
Component: [OLD] KDE (show other bugs)
Hardware: x86 Linux
: High major (vote)
Assignee: Gentoo KDE team
Depends on:
Reported: 2004-12-06 00:07 UTC by elpargo
Modified: 2004-12-07 04:10 UTC (History)
0 users

See Also:
Package list:
Runtime testing required: ---


Note You need to log in before you can comment on or make changes to this bug.
Description elpargo 2004-12-06 00:07:18 UTC
configure: WARNING: If you wanted to set the --build type, don't use --host.
    If a cross compiler is detected then cross compile mode will be used.
In file included from katemainwindow.cpp:34:
katefileselector.h: In destructor `KFSConfigPage::~KFSConfigPage()':
katefileselector.h:148: internal compiler error: in pop_binding, at cp/decl.c:
Please submit a full bug report,
with preprocessed source if appropriate.
See <URL:> for instructions.
The bug is not reproducible, so it is likely a hardware or OS problem.
make[3]: *** [katemainwindow.lo] Error 1
make[3]: *** Waiting for unfinished jobs....
make[2]: *** [all-recursive] Error 1
make[1]: *** [all-recursive] Error 1
make: *** [all] Error 2

!!! ERROR: kde-base/kdebase-3.3.1 failed.
!!! Function kde_src_compile, Line 142, Exitcode 2
!!! died running emake, kde_src_compile:make
!!! If you need support, post the topmost build error, NOT this status message.

Reproducible: Always
Steps to Reproduce:
1.emerge kde
2. wait for 5-10min of compiling

Actual Results:  
emerge exits and fails 

Expected Results:  
emerge kde
Comment 1 Caleb Tennis (RETIRED) gentoo-dev 2004-12-07 04:10:17 UTC
> The bug is not reproducible, so it is likely a hardware or OS problem.

Unfortunately, we can't do anything about this.  Most likely culprit is bads ram or an overclocked/too hot CPU.