Gentoo Websites Logo
Go to: Gentoo Home Documentation Forums Lists Bugs Planet Store Wiki Get Gentoo!
Bug 732132 - dev-python/jsonpickle: fails tests with dev-python/ecdsa-0.15
Summary: dev-python/jsonpickle: fails tests with dev-python/ecdsa-0.15
Status: CONFIRMED
Alias: None
Product: Gentoo Linux
Classification: Unclassified
Component: Current packages (show other bugs)
Hardware: All Linux
: Normal normal (vote)
Assignee: Python Gentoo Team
URL: https://github.com/jsonpickle/jsonpic...
Whiteboard:
Keywords: TESTFAILURE
Depends on:
Blocks:
 
Reported: 2020-07-10 20:08 UTC by Sam James
Modified: 2020-12-23 11:53 UTC (History)
1 user (show)

See Also:
Package list:
Runtime testing required: ---


Attachments
build.log (file_732132.txt,55.67 KB, text/plain)
2020-07-10 20:08 UTC, Sam James
Details

Note You need to log in before you can comment on or make changes to this bug.
Description Sam James archtester gentoo-dev Security 2020-07-10 20:08:17 UTC
Created attachment 648834 [details]
build.log

============================================================================= FAILURES =============================================================================
___________________________________________________________________ EcdsaTestCase.test_roundtrip ___________________________________________________________________

self = <ecdsa_test.EcdsaTestCase testMethod=test_roundtrip>

    def test_roundtrip(self):
        if self.should_skip:
            return self.skip('ecdsa module is not installed')
    
        message = 'test'.encode('utf-8')
        key_pair = self.SigningKey.generate(curve=self.NIST384p)
        sig = key_pair.sign(message)
    
        serialized = jsonpickle.dumps(key_pair.get_verifying_key())
        restored = jsonpickle.loads(serialized)
>       self.assertTrue(restored.verify(sig, message))

tests/ecdsa_test.py:32: 
_ _ _ _ _ _ _ _ _ _ _ _ _ _ _ _ _ _ _ _ _ _ _ _ _ _ _ _ _ _ _ _ _ _ _ _ _ _ _ _ _ _ _ _ _ _ _ _ _ _ _ _ _ _ _ _ _ _ _ _ _ _ _ _ _ _ _ _ _ _ _ _ _ _ _ _ _ _ _ _ _ _ 
/usr/lib/python3.7/site-packages/ecdsa/keys.py:602: in verify
    return self.verify_digest(signature, digest, sigdecode, True)
/usr/lib/python3.7/site-packages/ecdsa/keys.py:648: in verify_digest
    r, s = sigdecode(signature, self.pubkey.order)
/usr/lib/python3.7/site-packages/ecdsa/util.py:312: in sigdecode_string
    l = orderlen(order)
_ _ _ _ _ _ _ _ _ _ _ _ _ _ _ _ _ _ _ _ _ _ _ _ _ _ _ _ _ _ _ _ _ _ _ _ _ _ _ _ _ _ _ _ _ _ _ _ _ _ _ _ _ _ _ _ _ _ _ _ _ _ _ _ _ _ _ _ _ _ _ _ _ _ _ _ _ _ _ _ _ _ 

order = {'py/object': 'builtins.mpz'}

    def orderlen(order):
>       return (1+len("%x" % order))//2  # bytes
E       TypeError: %x format: an integer is required, not dict

/usr/lib/python3.7/site-packages/ecdsa/util.py:40: TypeError
========================================================================= warnings summary =========================================================================
[snip]
===================================================================== short test summary info ======================================================================
FAILED tests/ecdsa_test.py::EcdsaTestCase::test_roundtrip - TypeError: %x format: an integer is required, not dict
====================================================== 1 failed, 267 passed, 21 skipped, 2 warnings in 7.61s =======================================================


----
Portage 2.3.102 (python 3.7.7-final-0, default/linux/arm64/17.0, gcc-9.3.0, glibc-2.31-r5, 4.9.0-4-arm64 aarch64)
=================================================================
System uname: Linux-4.9.0-4-arm64-aarch64-with-gentoo-2.7
KiB Mem:   131544964 total, 105319372 free
KiB Swap:    3321056 total,   2284112 free
Timestamp of repository gentoo: Fri, 10 Jul 2020 00:30:02 +0000
Head commit of repository gentoo: 166e987487e4e14fe07c8bcd6efe45b6f567294e
sh bash 5.0_p17
ld GNU ld (Gentoo 2.34 p4) 2.34.0
app-shells/bash:          5.0_p17::gentoo
dev-java/java-config:     2.2.0-r4::gentoo
dev-lang/perl:            5.30.3-r1::gentoo
dev-lang/python:          2.7.18::gentoo, 3.6.10-r2::gentoo, 3.7.7-r2::gentoo, 3.8.3::gentoo, 3.9.0_beta3::gentoo
dev-util/cmake:           3.17.3::gentoo
sys-apps/baselayout:      2.7::gentoo
sys-apps/openrc:          0.42.1::gentoo
sys-apps/sandbox:         2.20::gentoo
sys-devel/autoconf:       2.13-r1::gentoo, 2.69-r5::gentoo
sys-devel/automake:       1.13.4-r2::gentoo, 1.16.2::gentoo
sys-devel/binutils:       2.34-r1::gentoo
sys-devel/gcc:            9.3.0-r1::gentoo, 10.1.0-r1::gentoo
sys-devel/gcc-config:     2.3.1::gentoo
sys-devel/libtool:        2.4.6-r6::gentoo
sys-devel/make:           4.3::gentoo
sys-kernel/linux-headers: 5.7::gentoo (virtual/os-headers)
sys-libs/glibc:           2.31-r5::gentoo
Repositories:

gentoo
    location: /usr/gentoo
    sync-type: rsync
    sync-uri: rsync://rsync.gentoo.org/gentoo-portage
    priority: -1000
    sync-rsync-verify-metamanifest: yes
    sync-rsync-verify-jobs: 1
    sync-rsync-extra-opts:
    sync-rsync-verify-max-age: 24

ACCEPT_KEYWORDS="arm64 ~arm64"
ACCEPT_LICENSE="@FREE"
CBUILD="aarch64-unknown-linux-gnu"
CFLAGS="-O2 -pipe -march=native -fcommon"
CHOST="aarch64-unknown-linux-gnu"
CONFIG_PROTECT="/etc /usr/share/config /usr/share/gnupg/qualified.txt"
CONFIG_PROTECT_MASK="/etc/ca-certificates.conf /etc/dconf /etc/env.d /etc/fonts/fonts.conf /etc/gconf /etc/gentoo-release /etc/php/apache2-php7.2/ext-active/ /etc/php/apache2-php7.4/ext-active/ /etc/php/cgi-php7.2/ext-active/ /etc/php/cgi-php7.4/ext-active/ /etc/php/cli-php7.2/ext-active/ /etc/php/cli-php7.4/ext-active/ /etc/portage/package.keywords/zz-autounmask /etc/portage/package.use/archtest /etc/revdep-rebuild /etc/sandbox.d /etc/terminfo /etc/texmf/language.dat.d /etc/texmf/language.def.d /etc/texmf/updmap.d /etc/texmf/web2c"
CXXFLAGS="-O2 -pipe -march=native -fcommon"
DISTDIR="/usr/portage/distfiles"
EMERGE_DEFAULT_OPTS="--jobs=2"
ENV_UNSET="DBUS_SESSION_BUS_ADDRESS DISPLAY GOBIN GOPATH PERL5LIB PERL5OPT PERLPREFIX PERL_CORE PERL_MB_OPT PERL_MM_OPT XAUTHORITY XDG_CACHE_HOME XDG_CONFIG_HOME XDG_DATA_HOME XDG_RUNTIME_DIR"
FCFLAGS="-O2 -pipe -march=native -fcommon"
FEATURES="assume-digests binpkg-docompress binpkg-dostrip binpkg-logs config-protect-if-modified distlocks ebuild-locks fixlafiles ipc-sandbox merge-sync multilib-strict network-sandbox news parallel-fetch pid-sandbox preserve-libs protect-owned qa-unresolved-soname-deps sandbox sfperms strict unknown-features-warn unmerge-logs unmerge-orphans userfetch userpriv usersandbox usersync xattr"
FFLAGS="-O2 -pipe -march=native -fcommon"
GENTOO_MIRRORS="http://distfiles.gentoo.org"
LANG="en_US.UTF-8"
LDFLAGS="-Wl,-O1 -Wl,--as-needed -Wl,--defsym=__gentoo_check_ldflags__=0"
MAKEOPTS="-j80"
PKGDIR="/usr/portage/packages"
PORTAGE_CONFIGROOT="/"
PORTAGE_RSYNC_OPTS="--recursive --links --safe-links --perms --times --omit-dir-times --compress --force --whole-file --delete --stats --human-readable --timeout=180 --exclude=/distfiles --exclude=/local --exclude=/packages --exclude=/.git"
PORTAGE_TMPDIR="/var/tmp"
USE="acl arm64 berkdb bzip2 cli crypt dri eselect-ldso fortran gdbm iconv ipv6 libtirpc ncurses nls nptl openmp pam pcre readline seccomp split-usr ssl tcpd unicode xattr zlib" ADA_TARGET="gnat_2018" APACHE2_MODULES="authn_core authz_core socache_shmcb unixd actions alias auth_basic authn_alias authn_anon authn_dbm authn_default authn_file authz_dbm authz_default authz_groupfile authz_host authz_owner authz_user autoindex cache cgi cgid dav dav_fs dav_lock deflate dir disk_cache env expires ext_filter file_cache filter headers include info log_config logio mem_cache mime mime_magic negotiation rewrite setenvif speling status unique_id userdir usertrack vhost_alias" CALLIGRA_FEATURES="karbon sheets words" COLLECTD_PLUGINS="df interface irq load memory rrdtool swap syslog" CPU_FLAGS_ARM="edsp thumb thumb2 v4 v5 v6 v7 v8 vfp vfp-d32 vfpv3 vfpv4" ELIBC="glibc" GPSD_PROTOCOLS="ashtech aivdm earthmate evermore fv18 garmin garmintxt gpsclock greis isync itrax mtk3301 nmea ntrip navcom oceanserver oldstyle oncore rtcm104v2 rtcm104v3 sirf skytraq superstar2 timing tsip tripmate tnt ublox ubx" INPUT_DEVICES="libinput" KERNEL="linux" LCD_DEVICES="bayrad cfontz cfontz633 glk hd44780 lb216 lcdm001 mtxorb ncurses text" LIBREOFFICE_EXTENSIONS="presenter-console presenter-minimizer" OFFICE_IMPLEMENTATION="libreoffice" PHP_TARGETS="php7-2" POSTGRES_TARGETS="postgres10 postgres11" PYTHON_SINGLE_TARGET="python3_7" PYTHON_TARGETS="python2_7 python3_7" RUBY_TARGETS="ruby25" USERLAND="GNU" VIDEO_CARDS="fbdev dummy v4l" XTABLES_ADDONS="quota2 psd pknock lscan length2 ipv4options ipset ipp2p iface geoip fuzzy condition tee tarpit sysrq steal rawnat logmark ipmark dhcpmac delude chaos account"
Unset:  CC, CPPFLAGS, CTARGET, CXX, INSTALL_MASK, LC_ALL, LINGUAS, PORTAGE_BINHOST, PORTAGE_BUNZIP2_COMMAND, PORTAGE_COMPRESS, PORTAGE_COMPRESS_FLAGS, PORTAGE_RSYNC_EXTRA_OPTS