Gentoo Websites Logo
Go to: Gentoo Home Documentation Forums Lists Bugs Planet Store Wiki Get Gentoo!
Bug 722550 - net-ftp/ncftp-3.2.6: fails to build with -fno-common or gcc-10
Summary: net-ftp/ncftp-3.2.6: fails to build with -fno-common or gcc-10
Status: CONFIRMED
Alias: None
Product: Gentoo Linux
Classification: Unclassified
Component: Current packages (show other bugs)
Hardware: All Linux
: Normal normal (vote)
Assignee: Jeroen Roovers
URL:
Whiteboard:
Keywords:
Depends on:
Blocks: -fno-common
  Show dependency tree
 
Reported: 2020-05-11 20:50 UTC by Evan Teran
Modified: 2020-05-11 22:06 UTC (History)
1 user (show)

See Also:
Package list:
Runtime testing required: ---


Attachments

Note You need to log in before you can comment on or make changes to this bug.
Description Evan Teran 2020-05-11 20:50:01 UTC
/usr/lib/gcc/x86_64-pc-linux-gnu/10.1.0/../../../../x86_64-pc-linux-gnu/bin/ld: bookmark.o:/var/tmp/portage/net-ftp/ncftp-3.2.6/work/ncftp-3.2.6/sh_util/../ncftp/bookmark.c:27: multiple definition of `gBm'; gpshare.o:/var/tmp/portage/net-ftp/ncftp-3.2.6/work/ncftp-3.2.6/sh_util/gpshare.c:31: first defined here
collect2: error: ld returned 1 exit status
make[1]: *** [Makefile:41: ../bin/ncftpbatch] Error 1
make[1]: *** Waiting for unfinished jobs....
/usr/lib/gcc/x86_64-pc-linux-gnu/10.1.0/../../../../x86_64-pc-linux-gnu/bin/ld: bookmark.o:/var/tmp/portage/net-ftp/ncftp-3.2.6/work/ncftp-3.2.6/sh_util/../ncftp/bookmark.c:27: multiple definition of `gBm'; gpshare.o:/var/tmp/portage/net-ftp/ncftp-3.2.6/work/ncftp-3.2.6/sh_util/gpshare.c:31: first defined here
/usr/lib/gcc/x86_64-pc-linux-gnu/10.1.0/../../../../x86_64-pc-linux-gnu/bin/ld: bookmark.o:/var/tmp/portage/net-ftp/ncftp-3.2.6/work/ncftp-3.2.6/sh_util/../ncftp/bookmark.c:27: multiple definition of `gBm'; gpshare.o:/var/tmp/portage/net-ftp/ncftp-3.2.6/work/ncftp-3.2.6/sh_util/gpshare.c:31: first defined here
/usr/lib/gcc/x86_64-pc-linux-gnu/10.1.0/../../../../x86_64-pc-linux-gnu/bin/ld: bookmark.o:/var/tmp/portage/net-ftp/ncftp-3.2.6/work/ncftp-3.2.6/sh_util/../ncftp/bookmark.c:27: multiple definition of `gBm'; gpshare.o:/var/tmp/portage/net-ftp/ncftp-3.2.6/work/ncftp-3.2.6/sh_util/gpshare.c:31: first defined here
collect2: error: ld returned 1 exit status
make[1]: *** [Makefile:33: ../bin/ncftpput] Error 1
collect2: error: ld returned 1 exit status
make[1]: *** [Makefile:29: ../bin/ncftpget] Error 1
collect2: error: ld returned 1 exit status
make[1]: *** [Makefile:37: ../bin/ncftpls] Error 1
make[1]: Leaving directory '/var/tmp/portage/net-ftp/ncftp-3.2.6/work/ncftp-3.2.6/sh_util'
make: *** [Makefile:39: progs] Error 2
 * ERROR: net-ftp/ncftp-3.2.6::gentoo failed (compile phase):
 *   emake failed
 * 
 * If you need support, post the output of `emerge --info '=net-ftp/ncftp-3.2.6::gentoo'`,
 * the complete build log and the output of `emerge -pqv '=net-ftp/ncftp-3.2.6::gentoo'`.
 * The complete build log is located at '/var/tmp/portage/net-ftp/ncftp-3.2.6/temp/build.log'.
 * The ebuild environment file is located at '/var/tmp/portage/net-ftp/ncftp-3.2.6/temp/environment'.
 * Working directory: '/var/tmp/portage/net-ftp/ncftp-3.2.6/work/ncftp-3.2.6'
 * S: '/var/tmp/portage/net-ftp/ncftp-3.2.6/work/ncftp-3.2.6'


Reproducible: Always