Gentoo Websites Logo
Go to: Gentoo Home Documentation Forums Lists Bugs Planet Store Wiki Get Gentoo!
Bug 716280 - sci-chemistry/theseus-3.3.0 : NWfill.c: fatal error: error.h: No such file or directory
Summary: sci-chemistry/theseus-3.3.0 : NWfill.c: fatal error: error.h: No such file or...
Status: CONFIRMED
Alias: None
Product: Gentoo Linux
Classification: Unclassified
Component: Current packages (show other bugs)
Hardware: All Linux
: Normal normal (vote)
Assignee: Gentoo musl team
URL:
Whiteboard:
Keywords:
Depends on:
Blocks: missing-musl-includes
  Show dependency tree
 
Reported: 2020-04-05 09:10 UTC by Toralf Förster
Modified: 2020-04-05 09:10 UTC (History)
1 user (show)

See Also:
Package list:
Runtime testing required: ---


Attachments
emerge-info.txt (emerge-info.txt,16.89 KB, text/plain)
2020-04-05 09:10 UTC, Toralf Förster
Details
emerge-history.txt (emerge-history.txt,303.83 KB, text/plain)
2020-04-05 09:10 UTC, Toralf Förster
Details
environment (environment,43.13 KB, text/plain)
2020-04-05 09:10 UTC, Toralf Förster
Details
etc.portage.tbz2 (etc.portage.tbz2,25.30 KB, application/x-bzip)
2020-04-05 09:10 UTC, Toralf Förster
Details
sci-chemistry:theseus-3.3.0:20200405-051111.log (sci-chemistry:theseus-3.3.0:20200405-051111.log,14.79 KB, text/plain)
2020-04-05 09:10 UTC, Toralf Förster
Details
temp.tbz2 (temp.tbz2,13.44 KB, application/x-bzip)
2020-04-05 09:10 UTC, Toralf Förster
Details

Note You need to log in before you can comment on or make changes to this bug.
Description Toralf Förster gentoo-dev 2020-04-05 09:10:37 UTC
x86_64-gentoo-linux-musl-gcc  -O2 -pipe -march=native -std=c11   -c StructAlign.c
x86_64-gentoo-linux-musl-gcc  -O2 -pipe -march=native -std=c11   -c NWfill.c
NWfill.c:39:10: fatal error: error.h: No such file or directory
   39 | #include error.h
      |          ^~~~~~~~~
compilation terminated.

  -------------------------------------------------------------------

  This is an unstable amd64 chroot image at a tinderbox (==build bot)
  name: 17.0_musl_hardened-20200328-201618

  -------------------------------------------------------------------

  Please see the tracker bug for details.

gcc-config -l:
 [1] x86_64-gentoo-linux-musl-9.3.0 *
clang version 10.0.0 
Target: x86_64-gentoo-linux-musl
Thread model: posix
InstalledDir: /usr/lib/llvm/10/bin
/usr/lib/llvm/10
10.0.0
Available Python interpreters, in order of preference:
  [1]   python3.8
  [2]   python3.7
  [3]   python3.6
  [4]   python2.7 (fallback)
Available Ruby profiles:
  [1]   ruby24 (with Rubygems)
  [2]   ruby25 (with Rubygems) *
Available Rust versions:
  [1]   rust-1.42.0 *
Available Java Virtual Machines:
  (none found)


timestamp of HEAD at this tinderbox image:
/var/db/repos/gentoo	Sun Apr  5 03:07:54 UTC 2020
/var/db/repos/musl	Sat Apr  4 03:02:24 UTC 2020

emerge -qpvO sci-chemistry/theseus
[ebuild  N    ] sci-chemistry/theseus-3.3.0  USE="-examples"
Comment 1 Toralf Förster gentoo-dev 2020-04-05 09:10:40 UTC
Created attachment 630322 [details]
emerge-info.txt
Comment 2 Toralf Förster gentoo-dev 2020-04-05 09:10:42 UTC
Created attachment 630324 [details]
emerge-history.txt
Comment 3 Toralf Förster gentoo-dev 2020-04-05 09:10:45 UTC
Created attachment 630326 [details]
environment
Comment 4 Toralf Förster gentoo-dev 2020-04-05 09:10:48 UTC
Created attachment 630328 [details]
etc.portage.tbz2
Comment 5 Toralf Förster gentoo-dev 2020-04-05 09:10:50 UTC
Created attachment 630330 [details]
sci-chemistry:theseus-3.3.0:20200405-051111.log
Comment 6 Toralf Förster gentoo-dev 2020-04-05 09:10:53 UTC
Created attachment 630332 [details]
temp.tbz2