Gentoo Websites Logo
Go to: Gentoo Home Documentation Forums Lists Bugs Planet Store Wiki Get Gentoo!
Bug 715476 - dev-lang/teyjus-2.1-r1 : ../.../standardlib.h: fatal error: bits/wordsize.h: No such file or directory
Summary: dev-lang/teyjus-2.1-r1 : ../.../standardlib.h: fatal error: bits/wordsize.h: ...
Status: CONFIRMED
Alias: None
Product: Gentoo Linux
Classification: Unclassified
Component: Current packages (show other bugs)
Hardware: All Linux
: Normal normal (vote)
Assignee: Gentoo musl team
URL:
Whiteboard:
Keywords:
Depends on:
Blocks: missing-musl-includes
  Show dependency tree
 
Reported: 2020-03-30 16:23 UTC by Toralf Förster
Modified: 2020-03-30 16:23 UTC (History)
1 user (show)

See Also:
Package list:
Runtime testing required: ---


Attachments
emerge-info.txt (emerge-info.txt,15.28 KB, text/plain)
2020-03-30 16:23 UTC, Toralf Förster
Details
dev-lang:teyjus-2.1-r1:20200330-154048.log (dev-lang:teyjus-2.1-r1:20200330-154048.log,152.48 KB, text/plain)
2020-03-30 16:23 UTC, Toralf Förster
Details
emerge-history.txt (emerge-history.txt,98.28 KB, text/plain)
2020-03-30 16:23 UTC, Toralf Förster
Details
environment (environment,59.36 KB, text/plain)
2020-03-30 16:23 UTC, Toralf Förster
Details
etc.portage.tbz2 (etc.portage.tbz2,11.34 KB, application/x-bzip)
2020-03-30 16:23 UTC, Toralf Förster
Details
temp.tbz2 (temp.tbz2,132.03 KB, application/x-bzip)
2020-03-30 16:23 UTC, Toralf Förster
Details

Note You need to log in before you can comment on or make changes to this bug.
Description Toralf Förster gentoo-dev 2020-03-30 16:23:27 UTC
In file included from vector.h:23,
                 from vector.c:22:
../include/standardlib.h:70:12: fatal error: bits/wordsize.h: No such file or directory
   70 | #  include <bits/wordsize.h>
      |            ^~~~~~~~~~~~~~~~~
compilation terminated.

  -------------------------------------------------------------------

  This is an unstable amd64 chroot image at a tinderbox (==build bot)
  name: 17.0_musl_hardened-20200328-201618

  -------------------------------------------------------------------

  Please see the tracker bug for details.

gcc-config -l:
 [1] x86_64-gentoo-linux-musl-9.3.0 *
clang version 10.0.0 
Target: x86_64-gentoo-linux-musl
Thread model: posix
InstalledDir: /usr/lib/llvm/10/bin
/usr/lib/llvm/10
10.0.0
Available Python interpreters, in order of preference:
  [1]   python3.8
  [2]   python3.7
  [3]   python3.6
  [4]   python2.7 (fallback)
Available Ruby profiles:
  [1]   ruby24 (with Rubygems)
  [2]   ruby25 (with Rubygems) *
Available Rust versions:
  [1]   rust-1.42.0 *

timestamp of HEAD at this tinderbox image:
/var/db/repos/gentoo	Mon Mar 30 14:38:53 UTC 2020
/var/db/repos/musl	Fri Mar 27 00:25:27 UTC 2020

emerge -qpvO dev-lang/teyjus
[ebuild  N    ] dev-lang/teyjus-2.1-r1  USE="ocamlopt -emacs -examples"
Comment 1 Toralf Förster gentoo-dev 2020-03-30 16:23:30 UTC
Created attachment 627482 [details]
emerge-info.txt
Comment 2 Toralf Förster gentoo-dev 2020-03-30 16:23:33 UTC
Created attachment 627484 [details]
dev-lang:teyjus-2.1-r1:20200330-154048.log
Comment 3 Toralf Förster gentoo-dev 2020-03-30 16:23:36 UTC
Created attachment 627486 [details]
emerge-history.txt
Comment 4 Toralf Förster gentoo-dev 2020-03-30 16:23:38 UTC
Created attachment 627488 [details]
environment
Comment 5 Toralf Förster gentoo-dev 2020-03-30 16:23:41 UTC
Created attachment 627490 [details]
etc.portage.tbz2
Comment 6 Toralf Förster gentoo-dev 2020-03-30 16:23:44 UTC
Created attachment 627492 [details]
temp.tbz2