Gentoo Websites Logo
Go to: Gentoo Home Documentation Forums Lists Bugs Planet Store Wiki Get Gentoo!
Bug 714414 - sys-libs/glibc-2.30-r6 fails 2 tests on ppc
Summary: sys-libs/glibc-2.30-r6 fails 2 tests on ppc
Status: RESOLVED OBSOLETE
Alias: None
Product: Gentoo Linux
Classification: Unclassified
Component: Current packages (show other bugs)
Hardware: PPC Linux
: Normal normal (vote)
Assignee: Gentoo Toolchain Maintainers
URL:
Whiteboard:
Keywords: TESTFAILURE
Depends on:
Blocks:
 
Reported: 2020-03-24 18:35 UTC by ernsteiswuerfel
Modified: 2020-10-30 19:30 UTC (History)
2 users (show)

See Also:
Package list:
Runtime testing required: ---


Attachments
build.log.xz (glibc-2.30-r6:20200323-121816.log.xz,530.19 KB, application/x-xz)
2020-03-24 18:35 UTC, ernsteiswuerfel
Details
emerge --info (file_714414.txt,6.37 KB, text/plain)
2020-03-24 18:36 UTC, ernsteiswuerfel
Details

Note You need to log in before you can comment on or make changes to this bug.
Description ernsteiswuerfel 2020-03-24 18:35:13 UTC
Created attachment 625334 [details]
build.log.xz

[..]
FAIL: elf/tst-debug1
FAIL: math/tst-definitions
Summary of test results:
      2 FAIL
   5209 PASS
     26 UNSUPPORTED
     18 XFAIL
      4 XPASS
make[1]: *** [Makefile:413: tests] Error 1
make[1]: Leaving directory '/var/tmp/portage/sys-libs/glibc-2.30-r6/work/glibc-2.30'
make: *** [Makefile:9: check] Error 2

Looks pretty good compared to 2.28-r5 on ppc (bug #677234) or 2.30-r6 on ppc64 (bug #694970).
Comment 1 ernsteiswuerfel 2020-03-24 18:36:08 UTC
Created attachment 625336 [details]
emerge --info