Gentoo Websites Logo
Go to: Gentoo Home Documentation Forums Lists Bugs Planet Store Wiki Get Gentoo!
Bug 714028 - sys-fs/aufs-util-4.14_p20190603 : au_util.h: fatal error: error_at_line.h: No such file or directory
Summary: sys-fs/aufs-util-4.14_p20190603 : au_util.h: fatal error: error_at_line.h: No...
Status: CONFIRMED
Alias: None
Product: Gentoo Linux
Classification: Unclassified
Component: Current packages (show other bugs)
Hardware: All Linux
: Normal normal (vote)
Assignee: No maintainer - Look at https://wiki.gentoo.org/wiki/Project:Proxy_Maintainers if you want to take care of it
URL:
Whiteboard:
Keywords:
Depends on:
Blocks: missing-musl-includes
  Show dependency tree
 
Reported: 2020-03-22 20:04 UTC by Toralf Förster
Modified: 2020-08-05 07:25 UTC (History)
1 user (show)

See Also:
Package list:
Runtime testing required: ---


Attachments
emerge-info.txt (emerge-info.txt,17.23 KB, text/plain)
2020-03-22 20:04 UTC, Toralf Förster
Details
emerge-history.txt (emerge-history.txt,277.94 KB, text/plain)
2020-03-22 20:05 UTC, Toralf Förster
Details
environment (environment,87.94 KB, text/plain)
2020-03-22 20:05 UTC, Toralf Förster
Details
etc.portage.tbz2 (etc.portage.tbz2,20.99 KB, application/x-bzip)
2020-03-22 20:05 UTC, Toralf Förster
Details
sys-fs:aufs-util-4.14_p20190603:20200322-194213.log (sys-fs:aufs-util-4.14_p20190603:20200322-194213.log,2.56 KB, text/plain)
2020-03-22 20:05 UTC, Toralf Förster
Details
temp.tbz2 (temp.tbz2,21.62 KB, application/x-bzip)
2020-03-22 20:05 UTC, Toralf Förster
Details

Note You need to log in before you can comment on or make changes to this bug.
Description Toralf Förster gentoo-dev 2020-03-22 20:04:56 UTC
x86_64-gentoo-linux-musl-gcc -O2 -pipe -march=native -fno-common -falign-functions=32:25:16 -Wall -D_GNU_SOURCE -I./libau -DAUFHSM_CMD=\/usr/bin/aufhsm\ -DMOUNT_CMD=\/bin/mount\ -DUMOUNT_CMD=\/bin/umount\ -Wl,-O1 -Wl,--as-needed  ver.c   -o ver
In file included from ver.c:25:
au_util.h:32:10: fatal error: error_at_line.h: No such file or directory
   32 | #include error_at_line.h
      |          ^~~~~~~~~~~~~~~~~
compilation terminated.

  -------------------------------------------------------------------

  This is an unstable amd64 chroot image at a tinderbox (==build bot)
  name: 17.0_musl-20200316-165821

  -------------------------------------------------------------------

  Please see the tracker bug for details.

gcc-config -l:
 [1] x86_64-gentoo-linux-musl-9.3.0 *
clang version 10.0.0 
Target: x86_64-gentoo-linux-musl
Thread model: posix
InstalledDir: /usr/lib/llvm/10/bin
/usr/lib/llvm/10
10.0.0
Available Python interpreters, in order of preference:
  [1]   python3.8
  [2]   python3.7
  [3]   python3.6
  [4]   python2.7 (fallback)
Available Ruby profiles:
  [1]   ruby24 (with Rubygems)
  [2]   ruby25 (with Rubygems) *
Available Rust versions:
  [1]   rust-1.41.1 *

timestamp of HEAD at this tinderbox image:
/var/db/repos/gentoo	Sun Mar 22 18:14:26 UTC 2020
/var/db/repos/musl	Sun Mar 22 15:02:57 UTC 2020

emerge -qpvO sys-fs/aufs-util
[ebuild  N    ] sys-fs/aufs-util-4.14_p20190603
Comment 1 Toralf Förster gentoo-dev 2020-03-22 20:04:58 UTC
Created attachment 624558 [details]
emerge-info.txt
Comment 2 Toralf Förster gentoo-dev 2020-03-22 20:05:01 UTC
Created attachment 624560 [details]
emerge-history.txt
Comment 3 Toralf Förster gentoo-dev 2020-03-22 20:05:04 UTC
Created attachment 624562 [details]
environment
Comment 4 Toralf Förster gentoo-dev 2020-03-22 20:05:07 UTC
Created attachment 624564 [details]
etc.portage.tbz2
Comment 5 Toralf Förster gentoo-dev 2020-03-22 20:05:10 UTC
Created attachment 624566 [details]
sys-fs:aufs-util-4.14_p20190603:20200322-194213.log
Comment 6 Toralf Förster gentoo-dev 2020-03-22 20:05:12 UTC
Created attachment 624568 [details]
temp.tbz2
Comment 7 Sam James archtester gentoo-dev Security 2020-03-31 20:04:48 UTC
Several patches but I don't think any are relevant:
https://git.alpinelinux.org/aports/tree/testing/aufs-util?h=master