Gentoo Websites Logo
Go to: Gentoo Home Documentation Forums Lists Bugs Planet Store Wiki Get Gentoo!
Bug 713420 - sci-mathematics/minisat-2.2.0_p20130925-r1 : ./.../System.h: fatal error: fpu_control.h: No such file or directory
Summary: sci-mathematics/minisat-2.2.0_p20130925-r1 : ./.../System.h: fatal error: fpu...
Status: CONFIRMED
Alias: None
Product: Gentoo Linux
Classification: Unclassified
Component: Current packages (show other bugs)
Hardware: All Linux
: Normal normal (vote)
Assignee: Gentoo musl team
URL:
Whiteboard:
Keywords:
Depends on:
Blocks:
 
Reported: 2020-03-19 11:17 UTC by Toralf Förster
Modified: 2020-03-19 11:17 UTC (History)
1 user (show)

See Also:
Package list:
Runtime testing required: ---


Attachments
emerge-info.txt (emerge-info.txt,16.35 KB, text/plain)
2020-03-19 11:17 UTC, Toralf Förster
Details
emerge-history.txt (emerge-history.txt,128.36 KB, text/plain)
2020-03-19 11:17 UTC, Toralf Förster
Details
environment (environment,49.77 KB, text/plain)
2020-03-19 11:17 UTC, Toralf Förster
Details
etc.portage.tbz2 (etc.portage.tbz2,12.84 KB, application/x-bzip)
2020-03-19 11:17 UTC, Toralf Förster
Details
sci-mathematics:minisat-2.2.0_p20130925-r1:20200319-051928.log (sci-mathematics:minisat-2.2.0_p20130925-r1:20200319-051928.log,3.93 KB, text/plain)
2020-03-19 11:17 UTC, Toralf Förster
Details
temp.tbz2 (temp.tbz2,13.61 KB, application/x-bzip)
2020-03-19 11:17 UTC, Toralf Förster
Details

Note You need to log in before you can comment on or make changes to this bug.
Description Toralf Förster gentoo-dev 2020-03-19 11:17:39 UTC
c++ -I. -D __STDC_LIMIT_MACROS -D __STDC_FORMAT_MACROS -Wall -Wno-parentheses -Wextra -O2 -pipe -march=native -fno-common -falign-functions=32:25:16 -D NDEBUG -I/var/tmp/portage/sci-mathematics/minisat-2.2.0_p20130925-r1/work/minisat-2.2.0_p20130925/minisat  -fpic -O2 -pipe -march=native -fno-common -falign-functions=32:25:16 -c -o build/release/minisat/simp/Main.o minisat/simp/Main.cc -MMD -MF build/release/minisat/simp/Main.d
In file included from minisat/simp/Main.cc:24:
./minisat/utils/System.h:25:10: fatal error: fpu_control.h: No such file or directory
   25 | #include <fpu_control.h>
      |          ^~~~~~~~~~~~~~~
compilation terminated.

  -------------------------------------------------------------------

  This is an unstable amd64 chroot image at a tinderbox (==build bot)
  name: 17.0_musl-20200316-165821

  -------------------------------------------------------------------

gcc-config -l:
 [1] x86_64-gentoo-linux-musl-9.3.0 *
clang version 10.0.0 
Target: x86_64-gentoo-linux-musl
Thread model: posix
InstalledDir: /usr/lib/llvm/10/bin
/usr/lib/llvm/10
10.0.0
Available Python interpreters, in order of preference:
  [1]   python3.8
  [2]   python3.7
  [3]   python3.6
  [4]   python2.7 (fallback)
Available Ruby profiles:
  [1]   ruby24 (with Rubygems)
  [2]   ruby25 (with Rubygems) *
Available Rust versions:
  [1]   rust-1.41.1 *

repository:
==> /var/db/repos/gentoo/metadata/timestamp.chk <==
Wed, 18 Mar 2020 13:38:27 +0000
emerge -qpvO sci-mathematics/minisat
[ebuild  N    ] sci-mathematics/minisat-2.2.0_p20130925-r1  USE="-debug -doc"
Comment 1 Toralf Förster gentoo-dev 2020-03-19 11:17:42 UTC
Created attachment 622438 [details]
emerge-info.txt
Comment 2 Toralf Förster gentoo-dev 2020-03-19 11:17:45 UTC
Created attachment 622440 [details]
emerge-history.txt
Comment 3 Toralf Förster gentoo-dev 2020-03-19 11:17:48 UTC
Created attachment 622442 [details]
environment
Comment 4 Toralf Förster gentoo-dev 2020-03-19 11:17:51 UTC
Created attachment 622444 [details]
etc.portage.tbz2
Comment 5 Toralf Förster gentoo-dev 2020-03-19 11:17:54 UTC
Created attachment 622446 [details]
sci-mathematics:minisat-2.2.0_p20130925-r1:20200319-051928.log
Comment 6 Toralf Förster gentoo-dev 2020-03-19 11:17:57 UTC
Created attachment 622448 [details]
temp.tbz2