Gentoo Websites Logo
Go to: Gentoo Home Documentation Forums Lists Bugs Planet Store Wiki Get Gentoo!
Bug 691940 - app-crypt/p11-kit-0.23.16.1-r1 fails test test-managed - missing test plan
Summary: app-crypt/p11-kit-0.23.16.1-r1 fails test test-managed - missing test plan
Status: UNCONFIRMED
Alias: None
Product: Gentoo Linux
Classification: Unclassified
Component: Current packages (show other bugs)
Hardware: All Linux
: Normal normal (vote)
Assignee: Crypto team
URL:
Whiteboard:
Keywords: TESTFAILURE
Depends on:
Blocks:
 
Reported: 2019-08-11 15:28 UTC by eroen
Modified: 2019-08-12 06:57 UTC (History)
0 users

See Also:
Package list:
Runtime testing required: ---


Attachments
/var/log/portage/build/app-crypt/p11-kit-0.23.16.1-r1:20190811-152437.log (p11-kit-0.23.16.1-r1:20190811-152437.log,373.34 KB, text/plain)
2019-08-11 15:28 UTC, eroen
Details

Note You need to log in before you can comment on or make changes to this bug.
Description eroen 2019-08-11 15:28:40 UTC
Created attachment 586556 [details]
/var/log/portage/build/app-crypt/p11-kit-0.23.16.1-r1:20190811-152437.log

ERROR: test-managed - missing test plan
...
============================================================================
Testsuite summary for p11-kit 0.23.16
============================================================================
# TOTAL: 478
# PASS:  477
# SKIP:  0
# XFAIL: 0
# FAIL:  0
# XPASS: 0
# ERROR: 1
============================================================================
See ./test-suite.log
Please report to https://github.com/p11-glue/p11-kit/issues
============================================================================
make[4]: *** [Makefile:4755: test-suite.log] Error 1
make[4]: Leaving directory '/var/tmp/portage/app-crypt/p11-kit-0.23.16.1-r1/work/p11-kit-0.23.16.1-abi_x86_64.amd64'
make[3]: *** [Makefile:4863: check-TESTS] Error 2
make[3]: Leaving directory '/var/tmp/portage/app-crypt/p11-kit-0.23.16.1-r1/work/p11-kit-0.23.16.1-abi_x86_64.amd64'
make[2]: *** [Makefile:5462: check-am] Error 2
make[2]: Leaving directory '/var/tmp/portage/app-crypt/p11-kit-0.23.16.1-r1/work/p11-kit-0.23.16.1-abi_x86_64.amd64'
make[1]: *** [Makefile:4640: check-recursive] Error 1
make[1]: Leaving directory '/var/tmp/portage/app-crypt/p11-kit-0.23.16.1-r1/work/p11-kit-0.23.16.1-abi_x86_64.amd64'
make: *** [Makefile:5465: check] Error 2
 * ERROR: app-crypt/p11-kit-0.23.16.1-r1::gentoo failed (test phase):
 *   Make check failed. See above for details.
 * 
 * Call stack:
 *            ebuild.sh, line  125:  Called src_test
 *          environment, line 1614:  Called multilib-minimal_src_test
 *          environment, line 1116:  Called multilib_foreach_abi 'multilib-minimal_abi_src_test'
 *          environment, line 1301:  Called multibuild_foreach_variant '_multilib_multibuild_wrapper' 'multilib-minimal_abi_src_test'
 *          environment, line  981:  Called _multibuild_run '_multilib_multibuild_wrapper' 'multilib-minimal_abi_src_test'
 *          environment, line  979:  Called _multilib_multibuild_wrapper 'multilib-minimal_abi_src_test'
 *          environment, line  378:  Called multilib-minimal_abi_src_test
 *          environment, line 1112:  Called default_src_test
 *   phase-functions.sh, line  901:  Called __eapi0_src_test
 *     phase-helpers.sh, line  816:  Called die
 * The specific snippet of code:
 *   		$emake_cmd ${internal_opts} check || \
 *   			die "Make check failed. See above for details."
Comment 1 eroen 2019-08-11 15:29:26 UTC
occam ~ # emerge --info '=app-crypt/p11-kit-0.23.16.1-r1::gentoo'
Portage 2.3.71 (python 3.7.4-final-0, default/linux/amd64/17.0/hardened, gcc-9.1.0, glibc-2.28-r2, 5.2.3-gentoo-o0 x86_64)
=================================================================
                         System Settings
=================================================================
System uname: Linux-5.2.3-gentoo-o0-x86_64-Intel-R-_Core-TM-_i5-2520M_CPU_@_2.50GHz-with-gentoo-2.6
KiB Mem:     7997940 total,   2479996 free
KiB Swap:   16777212 total,  16687252 free
Timestamp of repository gentoo: Sun, 11 Aug 2019 12:30:01 +0000
Head commit of repository gentoo: 23932c30cbd5647cbc698b37c51ba0baaeeaa6b3
Timestamp of repository eroen: Sun, 30 Oct 2016 21:58:42 +0000
Head commit of repository sapher: 9ef31d0bf6a902342746fb03a445d4f8b7ddabef

Head commit of repository wiktorb: 0c14c46dc4d87a4fa395bf65c132bf0a8b9d3df2

Head commit of repository gentoo-snappy: 0ea79c799ebe1bc6cd924b9dd707b710eea24e83

Head commit of repository stuff: 20475801d4c4a6072f3311c106ff0b406aa29d54

sh bash 5.0_p7
ld GNU ld (Gentoo 2.31.1 p7) 2.31.1
ccache version 3.5 [disabled]
app-shells/bash:          5.0_p7::gentoo
dev-java/java-config:     2.2.0-r4::gentoo
dev-lang/perl:            5.30.0::gentoo
dev-lang/python:          2.7.16::gentoo, 3.5.7::gentoo, 3.6.9::gentoo, 3.7.4-r1::gentoo
dev-util/ccache:          3.5-r1::gentoo
dev-util/cmake:           3.13.0::gentoo
dev-util/pkgconfig:       0.29.2::gentoo
sys-apps/baselayout:      2.6-r1::gentoo
sys-apps/openrc:          0.41.2::gentoo
sys-apps/sandbox:         2.18::gentoo
sys-devel/autoconf:       2.13-r1::gentoo, 2.69-r4::gentoo
sys-devel/automake:       1.11.6-r3::gentoo, 1.13.4-r2::gentoo, 1.15.1-r2::gentoo, 1.16.1-r1::gentoo
sys-devel/binutils:       2.31.1-r6::gentoo, 2.32-r1::gentoo
sys-devel/gcc:            6.4.0-r5::gentoo, 7.3.0-r6::gentoo, 8.2.0-r4::gentoo, 9.1.0-r1::gentoo
sys-devel/gcc-config:     2.0::gentoo
sys-devel/libtool:        2.4.6-r5::gentoo
sys-devel/make:           4.2.1-r4::gentoo
sys-kernel/linux-headers: 5.1::gentoo (virtual/os-headers)
sys-libs/glibc:           2.28-r2::gentoo
Repositories:

gentoo
    location: /usr/portage
    sync-type: rsync
    sync-uri: rsync://rsync.gentoo.org/gentoo-portage
    priority: -1000
    sync-rsync-verify-max-age: 24
    sync-rsync-verify-jobs: 1
    sync-rsync-extra-opts: 
    sync-rsync-verify-metamanifest: yes

crossdev
    location: /var/lib/portage/crossdev
    masters: gentoo

eroen
    location: /usr/local/portage
    masters: gentoo
    priority: 0

sapher
    location: /var/lib/overlays/sapher
    sync-type: git
    sync-uri: https://github.com/apinsard/sapher-overlay.git
    masters: gentoo

wiktorb
    location: /var/lib/overlays/wiktorb
    sync-type: git
    sync-uri: https://github.com/wiktor-b/overlay.git
    masters: gentoo

dotnet
    location: /var/lib/layman/dotnet
    masters: gentoo
    priority: 50

enlightenment
    location: /var/lib/layman/enlightenment
    masters: gentoo
    priority: 50

flora
    location: /var/lib/layman/flora
    masters: gentoo
    priority: 50

gamerlay
    location: /var/lib/layman/gamerlay
    masters: gentoo
    priority: 50

gentoo-snappy
    location: /usr/local/portage/gentoo-snappy
    sync-type: git
    sync-uri: https://github.com/zyga/gentoo-snappy.git
    masters: gentoo
    priority: 50

glc
    location: /var/lib/layman/glc
    masters: gentoo
    priority: 50

hardened-development
    location: /var/lib/layman/hardened-development
    masters: gentoo
    priority: 50

haskell
    location: /var/lib/layman/haskell
    masters: gentoo
    priority: 50

hasufell
    location: /var/lib/layman/hasufell
    masters: gentoo
    priority: 50

java
    location: /var/lib/layman/java
    masters: gentoo
    priority: 50

laurentb
    location: /var/lib/layman/laurentb
    masters: gentoo
    priority: 50

musl
    location: /var/lib/layman/musl
    masters: gentoo
    priority: 50

roslin
    location: /var/lib/layman/roslin
    masters: gentoo
    priority: 50

stuff
    location: /var/lib/layman/stuff
    sync-type: git
    sync-uri: https://github.com/istitov/stuff.git
    masters: gentoo
    priority: 50

sunrise
    location: /var/lib/layman/sunrise
    masters: gentoo
    priority: 50

toolchain
    location: /var/lib/layman/toolchain
    masters: gentoo
    priority: 50

v-fox
    location: /var/lib/layman/v-fox
    masters: gentoo
    priority: 50

ACCEPT_KEYWORDS="amd64 ~amd64"
ACCEPT_LICENSE="*"
CBUILD="x86_64-pc-linux-gnu"
CFLAGS="-march=corei7-avx -pipe -Og -g -gdwarf-4"
CHOST="x86_64-pc-linux-gnu"
CONFIG_PROTECT="/etc /usr/share/config /usr/share/easy-rsa /usr/share/gnupg/qualified.txt"
CONFIG_PROTECT_MASK="/etc/ca-certificates.conf /etc/dconf /etc/env.d /etc/fonts/fonts.conf /etc/gconf /etc/gentoo-release /etc/revdep-rebuild /etc/sandbox.d /etc/terminfo /etc/texmf/language.dat.d /etc/texmf/language.def.d /etc/texmf/updmap.d /etc/texmf/web2c"
CXXFLAGS="-march=corei7-avx -pipe -Og -g -gdwarf-4"
DISTDIR="/var/distfiles"
EMERGE_DEFAULT_OPTS="--jobs=1 --autounmask --quiet-build --nospinner --verbose-conflicts --verbose-slot-rebuilds"
ENV_UNSET="DBUS_SESSION_BUS_ADDRESS DISPLAY GOBIN PERL5LIB PERL5OPT PERLPREFIX PERL_CORE PERL_MB_OPT PERL_MM_OPT XAUTHORITY XDG_CACHE_HOME XDG_CONFIG_HOME XDG_DATA_HOME XDG_RUNTIME_DIR"
FCFLAGS="-O2 -pipe"
FEATURES="assume-digests binpkg-docompress binpkg-dostrip binpkg-logs binpkg-multi-instance cgroup collision-protect compressdebug config-protect-if-modified distlocks ebuild-locks fixlafiles installsources ipc-sandbox merge-sync multilib-strict network-sandbox news parallel-fetch parallel-install pid-sandbox preserve-libs protect-owned sandbox sfperms split-log splitdebug strict strict-keepdir test unknown-features-warn unmerge-logs unmerge-orphans userfetch userpriv usersandbox usersync xattr"
FFLAGS="-O2 -pipe"
GENTOO_MIRRORS="http://distfiles.gentoo.org"
INSTALL_MASK="/usr/share/locale -/usr/share/locale/en* -/usr/share/locale/nb* -/usr/share/locale/no*"
LANG="en_GB.utf8"
LDFLAGS="-Wl,-O1 -Wl,--as-needed -Wl,--hash-style=gnu"
MAKEOPTS="-j4 -l10"
PKGDIR="/var/packages"
PORTAGE_CONFIGROOT="/"
PORTAGE_RSYNC_OPTS="--recursive --links --safe-links --perms --times --omit-dir-times --compress --force --whole-file --delete --stats --human-readable --timeout=180 --exclude=/distfiles --exclude=/local --exclude=/packages --exclude=/.git"
PORTAGE_TMPDIR="/var/tmp"
USE="X a52 aac acl alsa amd64 apng audio audiofile avresample avx bash-completion bdf bluray bzip2 cairo caps cb cdda cdparanoia cdr cjk corefonts crypt cups curl cxx declarative detex device-mapper dga dia djvu dts dvd dvi2tty dvipdfm ebook egl exif fam ffmpeg fftw fits flac fontconfig g3dvl gallium gbm gcrypt gif gimp git glamor glib gmp gnuplot gnutls gold gpm graphics graphviz gs gstreamer gtk gtk3 hardened highlight iconv icu id3tag idn imagemagick imlib inotify iproute2 ipv6 jbig jpeg jpeg2k jpg json kde kde4 kpathsea latex lcms libffi libssh2 libtirpc libv4l luatex lvm lvm2 lzma lzo man metric mikmod mkv mms mmx mng mp3 mpeg mpg123 multilib multimedia musepack ncurses netlink nptl nut ocr odbc offensive ogg opengl openmp openvg optimization optimized-qmake opus pam pango pcre pdf pgf phonon pie png postscript private-headers pstricks pth publishers python3 qt3support qt4 raw readline samba sbsms scanner science sdl seccomp smp sna sndfile speex spell split-usr sqlite sse sse2 sse3 sse4 sse41 sse4_1 sse4_2 ssh ssl ssp ssse3 svg t1lib tesseract test theora threads tiff tls truetype udev unicode usb v4l v4l2 vaapi video vorbis vpx webp wmf x264 xanim xattr xcb xcomposite xetex xft xinerama xkb xml xmlpatterns xorg xosd xpm xrandr xtpax xv xvid xvmc xz zlib zsh-completion" ABI_X86="32 64" APACHE2_MODULES="authn_core authz_core socache_shmcb unixd actions alias auth_basic authn_alias authn_anon authn_dbm authn_default authn_file authz_dbm authz_default authz_groupfile authz_host authz_owner authz_user autoindex cache cgi cgid dav dav_fs dav_lock deflate dir disk_cache env expires ext_filter file_cache filter headers include info log_config logio mem_cache mime mime_magic negotiation rewrite setenvif speling status unique_id userdir usertrack vhost_alias" CALLIGRA_FEATURES="karbon sheets words" COLLECTD_PLUGINS="df interface irq load memory rrdtool swap syslog" CPU_FLAGS_X86="mmx sse sse2 avx sse3 ssse3 sse4_1 aes avx mmxext popcnt sse3 sse4_1 sse4_2 ssse3" CURL_SSL="openssl" ELIBC="glibc" GPSD_PROTOCOLS="ashtech aivdm earthmate evermore fv18 garmin garmintxt gpsclock isync itrax mtk3301 nmea ntrip navcom oceanserver oldstyle oncore rtcm104v2 rtcm104v3 sirf skytraq superstar2 timing tsip tripmate tnt ublox ubx" GRUB_PLATFORMS="efi-64" INPUT_DEVICES="evdev synaptics" KERNEL="linux" L10N="en en-US en-GB eng" LCD_DEVICES="bayrad cfontz cfontz633 glk hd44780 lb216 lcdm001 mtxorb ncurses text" LIBREOFFICE_EXTENSIONS="presenter-console presenter-minimizer" LLVM_TARGETS="AArch64 ARM BPF X86" NETBEANS_MODULES="apisupport cnd groovy gsf harness ide identity j2ee java mobility nb php profiler soa visualweb webcommon websvccommon xml" OFFICE_IMPLEMENTATION="libreoffice" PHP_TARGETS="php5-3 php5-4" POSTGRES_TARGETS="postgres11" PYTHON_SINGLE_TARGET="python3_7" PYTHON_TARGETS="python2_7 python3_5 python3_6 python3_7" QEMU_SOFTMMU_TARGETS="x86_64 i386" SANE_BACKENDS="plustek" USERLAND="GNU" VIDEO_CARDS="intel i965 ilo" XTABLES_ADDONS="quota2 psd pknock lscan length2 ipv4options ipset ipp2p iface geoip fuzzy condition tee tarpit sysrq steal rawnat logmark ipmark dhcpmac delude chaos account"
Unset:  CC, CPPFLAGS, CTARGET, CXX, LC_ALL, LINGUAS, PORTAGE_BINHOST, PORTAGE_BUNZIP2_COMMAND, PORTAGE_COMPRESS, PORTAGE_COMPRESS_FLAGS, PORTAGE_RSYNC_EXTRA_OPTS

occam ~ # emerge -pqv '=app-crypt/p11-kit-0.23.16.1-r1::gentoo'
[ebuild     U ] app-crypt/p11-kit-0.23.16.1-r1 [0.23.12] USE="-asn1 -debug -libffi -trust" ABI_X86="(64) -32 (-x32)"