Gentoo Websites Logo
Go to: Gentoo Home Documentation Forums Lists Bugs Planet Store Wiki Get Gentoo!
Bug 691452 - dev-python/sqlalchemy-1.3.4 fails test test/orm/test_unitofwork.py::EnsurePKSortableTest::test_exception_persistent_flush_py3k
Summary: dev-python/sqlalchemy-1.3.4 fails test test/orm/test_unitofwork.py::EnsurePKS...
Status: UNCONFIRMED
Alias: None
Product: Gentoo Linux
Classification: Unclassified
Component: Current packages (show other bugs)
Hardware: All Linux
: Normal normal (vote)
Assignee: Python Gentoo Team
URL:
Whiteboard:
Keywords: TESTFAILURE
Depends on:
Blocks:
 
Reported: 2019-08-04 20:09 UTC by eroen
Modified: 2019-08-07 16:17 UTC (History)
1 user (show)

See Also:
Package list:
Runtime testing required: ---


Attachments
dev-python/sqlalchemy-1.3.4:20190804-195338.log.bz2 (sqlalchemy-1.3.4:20190804-195338.log.bz2,148.52 KB, application/x-bzip)
2019-08-04 20:09 UTC, eroen
Details

Note You need to log in before you can comment on or make changes to this bug.
Description eroen 2019-08-04 20:09:22 UTC
=================================================== FAILURES ===================================================
__________________________ EnsurePKSortableTest.test_exception_persistent_flush_py3k ___________________________
Traceback (most recent call last):
  File "/var/tmp/portage/dev-python/sqlalchemy-1.3.4/work/SQLAlchemy-1.3.4/test/../lib/sqlalchemy/orm/persistence.py", line 1613, in _sort_states
    persistent_sorted = sorted(persistent, key=lambda q: q.key[1])
TypeError: unorderable types: MyNotSortableEnum() < MyNotSortableEnum()

During handling of the above exception, another exception occurred:

Traceback (most recent call last):
  File "/var/tmp/portage/dev-python/sqlalchemy-1.3.4/work/SQLAlchemy-1.3.4/test/../lib/sqlalchemy/testing/assertions.py", line 308, in assert_raises_message
    callable_(*args, **kwargs)
  File "/var/tmp/portage/dev-python/sqlalchemy-1.3.4/work/SQLAlchemy-1.3.4/test/../lib/sqlalchemy/orm/session.py", line 2458, in flush
    self._flush(objects)
  File "/var/tmp/portage/dev-python/sqlalchemy-1.3.4/work/SQLAlchemy-1.3.4/test/../lib/sqlalchemy/orm/session.py", line 2596, in _flush
    transaction.rollback(_capture_exception=True)
  File "/var/tmp/portage/dev-python/sqlalchemy-1.3.4/work/SQLAlchemy-1.3.4/test/../lib/sqlalchemy/util/langhelpers.py", line 68, in __exit__
    compat.reraise(exc_type, exc_value, exc_tb)
  File "/var/tmp/portage/dev-python/sqlalchemy-1.3.4/work/SQLAlchemy-1.3.4/test/../lib/sqlalchemy/util/compat.py", line 129, in reraise
    raise value
  File "/var/tmp/portage/dev-python/sqlalchemy-1.3.4/work/SQLAlchemy-1.3.4/test/../lib/sqlalchemy/orm/session.py", line 2556, in _flush
    flush_context.execute()
  File "/var/tmp/portage/dev-python/sqlalchemy-1.3.4/work/SQLAlchemy-1.3.4/test/../lib/sqlalchemy/orm/unitofwork.py", line 422, in execute
    rec.execute(self)
  File "/var/tmp/portage/dev-python/sqlalchemy-1.3.4/work/SQLAlchemy-1.3.4/test/../lib/sqlalchemy/orm/unitofwork.py", line 589, in execute
    uow,
  File "/var/tmp/portage/dev-python/sqlalchemy-1.3.4/work/SQLAlchemy-1.3.4/test/../lib/sqlalchemy/orm/persistence.py", line 213, in save_obj
    ) in _organize_states_for_save(base_mapper, states, uowtransaction):
  File "/var/tmp/portage/dev-python/sqlalchemy-1.3.4/work/SQLAlchemy-1.3.4/test/../lib/sqlalchemy/orm/persistence.py", line 374, in _organize_states_for_save
    base_mapper, uowtransaction, states
  File "/var/tmp/portage/dev-python/sqlalchemy-1.3.4/work/SQLAlchemy-1.3.4/test/../lib/sqlalchemy/orm/persistence.py", line 1590, in _connections_for_states
    for state in _sort_states(states):
  File "/var/tmp/portage/dev-python/sqlalchemy-1.3.4/work/SQLAlchemy-1.3.4/test/../lib/sqlalchemy/orm/persistence.py", line 1617, in _sort_states
    "values must be sortable in Python (was: %s)" % err
sqlalchemy.exc.InvalidRequestError: Could not sort objects by primary key; primary key values must be sortable in Python (was: unorderable types: MyNotSortableEnum() < MyNotSortableEnum())

During handling of the above exception, another exception occurred:

Traceback (most recent call last):
  File "/var/tmp/portage/dev-python/sqlalchemy-1.3.4/work/SQLAlchemy-1.3.4/test/orm/test_unitofwork.py", line 3447, in test_exception_persistent_flush_py3k
    s.flush,
  File "/var/tmp/portage/dev-python/sqlalchemy-1.3.4/work/SQLAlchemy-1.3.4/test/../lib/sqlalchemy/testing/assertions.py", line 313, in assert_raises_message
    e,
AssertionError: "Could not sort objects by primary key; primary key values must be sortable in Python \\(was: '<' not supported between instances of 'MyNotSortableEnum' and 'MyNotSortableEnum'\\)" !~ Could not sort objects by primary key; primary key values must be sortable in Python (was: unorderable types: MyNotSortableEnum() < MyNotSortableEnum())
=========================================== short test summary info ============================================
...
FAILED test/orm/test_unitofwork.py::EnsurePKSortableTest::test_exception_persistent_flush_py3k - AssertionErr...
============================= 1 failed, 8361 passed, 939 skipped in 235.46 seconds =============================
 * ERROR: dev-python/sqlalchemy-1.3.4::gentoo failed (test phase):
 *   Testsuite failed under python3.5
 * 
 * Call stack:
 *     ebuild.sh, line  125:  Called src_test
 *   environment, line 3210:  Called distutils-r1_src_test
 *   environment, line 1136:  Called _distutils-r1_run_foreach_impl 'python_test'
 *   environment, line  442:  Called python_foreach_impl 'distutils-r1_run_phase' 'python_test'
 *   environment, line 2651:  Called multibuild_foreach_variant '_python_multibuild_wrapper' 'distutils-r1_run_phase' 'python_test'
 *   environment, line 1947:  Called _multibuild_run '_python_multibuild_wrapper' 'distutils-r1_run_phase' 'python_test'
 *   environment, line 1945:  Called _python_multibuild_wrapper 'distutils-r1_run_phase' 'python_test'
 *   environment, line  708:  Called distutils-r1_run_phase 'python_test'
 *   environment, line 1067:  Called python_test
 *   environment, line 3031:  Called die
 * The specific snippet of code:
 *       pytest -vv test || die "Testsuite failed under ${EPYTHON}"
Comment 1 eroen 2019-08-04 20:09:56 UTC
Created attachment 585714 [details]
dev-python/sqlalchemy-1.3.4:20190804-195338.log.bz2
Comment 2 eroen 2019-08-04 20:10:42 UTC
occam ~ # emerge --info '=dev-python/sqlalchemy-1.3.4::gentoo'
Portage 2.3.69 (python 3.7.4-final-0, default/linux/amd64/17.0/hardened, gcc-9.1.0, glibc-2.28-r2, 5.2.3-gentoo-o0 x86_64)
=================================================================
                         System Settings
=================================================================
System uname: Linux-5.2.3-gentoo-o0-x86_64-Intel-R-_Core-TM-_i5-2520M_CPU_@_2.50GHz-with-gentoo-2.6
KiB Mem:     7997940 total,   4279592 free
KiB Swap:   16777212 total,  16766260 free
Timestamp of repository gentoo: Sun, 04 Aug 2019 15:00:01 +0000
Head commit of repository gentoo: df3d4c4420226ba1d512dbc567e5034909256949
Timestamp of repository eroen: Sun, 30 Oct 2016 21:58:42 +0000
Head commit of repository sapher: 9ef31d0bf6a902342746fb03a445d4f8b7ddabef

Head commit of repository wiktorb: 0c14c46dc4d87a4fa395bf65c132bf0a8b9d3df2

Head commit of repository gentoo-snappy: 0ea79c799ebe1bc6cd924b9dd707b710eea24e83

Head commit of repository stuff: 20475801d4c4a6072f3311c106ff0b406aa29d54

sh bash 5.0_p7
ld GNU ld (Gentoo 2.31.1 p7) 2.31.1
ccache version 3.5 [disabled]
app-shells/bash:          5.0_p7::gentoo
dev-java/java-config:     2.2.0-r4::gentoo
dev-lang/perl:            5.26.2::gentoo
dev-lang/python:          2.7.16::gentoo, 3.5.7::gentoo, 3.6.9::gentoo, 3.7.4-r1::gentoo
dev-util/ccache:          3.5-r1::gentoo
dev-util/cmake:           3.13.0::gentoo
dev-util/pkgconfig:       0.29.2::gentoo
sys-apps/baselayout:      2.6-r1::gentoo
sys-apps/openrc:          0.39.2::gentoo
sys-apps/sandbox:         2.13::gentoo
sys-devel/autoconf:       2.13::gentoo, 2.69-r4::gentoo
sys-devel/automake:       1.11.6-r3::gentoo, 1.13.4-r2::gentoo, 1.15.1-r2::gentoo, 1.16.1-r1::gentoo
sys-devel/binutils:       2.31.1-r6::gentoo, 2.32-r1::gentoo
sys-devel/gcc:            6.4.0-r5::gentoo, 7.3.0-r6::gentoo, 8.2.0-r4::gentoo, 9.1.0-r1::gentoo
sys-devel/gcc-config:     2.0::gentoo
sys-devel/libtool:        2.4.6-r5::gentoo
sys-devel/make:           4.2.1-r4::gentoo
sys-kernel/linux-headers: 4.19::gentoo (virtual/os-headers)
sys-libs/glibc:           2.28-r2::gentoo
Repositories:

gentoo
    location: /usr/portage
    sync-type: rsync
    sync-uri: rsync://rsync.gentoo.org/gentoo-portage
    priority: -1000
    sync-rsync-verify-jobs: 1
    sync-rsync-verify-metamanifest: yes
    sync-rsync-verify-max-age: 24
    sync-rsync-extra-opts: 

crossdev
    location: /var/lib/portage/crossdev
    masters: gentoo

eroen
    location: /usr/local/portage
    masters: gentoo
    priority: 0

sapher
    location: /var/lib/overlays/sapher
    sync-type: git
    sync-uri: https://github.com/apinsard/sapher-overlay.git
    masters: gentoo

wiktorb
    location: /var/lib/overlays/wiktorb
    sync-type: git
    sync-uri: https://github.com/wiktor-b/overlay.git
    masters: gentoo

dotnet
    location: /var/lib/layman/dotnet
    masters: gentoo
    priority: 50

enlightenment
    location: /var/lib/layman/enlightenment
    masters: gentoo
    priority: 50

flora
    location: /var/lib/layman/flora
    masters: gentoo
    priority: 50

gamerlay
    location: /var/lib/layman/gamerlay
    masters: gentoo
    priority: 50

gentoo-snappy
    location: /usr/local/portage/gentoo-snappy
    sync-type: git
    sync-uri: https://github.com/zyga/gentoo-snappy.git
    masters: gentoo
    priority: 50

glc
    location: /var/lib/layman/glc
    masters: gentoo
    priority: 50

hardened-development
    location: /var/lib/layman/hardened-development
    masters: gentoo
    priority: 50

haskell
    location: /var/lib/layman/haskell
    masters: gentoo
    priority: 50

hasufell
    location: /var/lib/layman/hasufell
    masters: gentoo
    priority: 50

java
    location: /var/lib/layman/java
    masters: gentoo
    priority: 50

laurentb
    location: /var/lib/layman/laurentb
    masters: gentoo
    priority: 50

musl
    location: /var/lib/layman/musl
    masters: gentoo
    priority: 50

roslin
    location: /var/lib/layman/roslin
    masters: gentoo
    priority: 50

stuff
    location: /var/lib/layman/stuff
    sync-type: git
    sync-uri: https://github.com/istitov/stuff.git
    masters: gentoo
    priority: 50

sunrise
    location: /var/lib/layman/sunrise
    masters: gentoo
    priority: 50

toolchain
    location: /var/lib/layman/toolchain
    masters: gentoo
    priority: 50

v-fox
    location: /var/lib/layman/v-fox
    masters: gentoo
    priority: 50

ACCEPT_KEYWORDS="amd64 ~amd64"
ACCEPT_LICENSE="*"
CBUILD="x86_64-pc-linux-gnu"
CFLAGS="-march=corei7-avx -pipe -Og -g -gdwarf-4"
CHOST="x86_64-pc-linux-gnu"
CONFIG_PROTECT="/etc /usr/share/config /usr/share/easy-rsa /usr/share/gnupg/qualified.txt"
CONFIG_PROTECT_MASK="/etc/ca-certificates.conf /etc/dconf /etc/env.d /etc/fonts/fonts.conf /etc/gconf /etc/gentoo-release /etc/revdep-rebuild /etc/sandbox.d /etc/terminfo /etc/texmf/language.dat.d /etc/texmf/language.def.d /etc/texmf/updmap.d /etc/texmf/web2c"
CXXFLAGS="-march=corei7-avx -pipe -Og -g -gdwarf-4"
DISTDIR="/var/distfiles"
EMERGE_DEFAULT_OPTS="--jobs=1 --autounmask --quiet-build --nospinner --verbose-conflicts --verbose-slot-rebuilds"
ENV_UNSET="DBUS_SESSION_BUS_ADDRESS DISPLAY GOBIN PERL5LIB PERL5OPT PERLPREFIX PERL_CORE PERL_MB_OPT PERL_MM_OPT XAUTHORITY XDG_CACHE_HOME XDG_CONFIG_HOME XDG_DATA_HOME XDG_RUNTIME_DIR"
FCFLAGS="-O2 -pipe"
FEATURES="assume-digests binpkg-docompress binpkg-dostrip binpkg-logs binpkg-multi-instance cgroup collision-protect compressdebug config-protect-if-modified distlocks ebuild-locks fixlafiles installsources ipc-sandbox merge-sync multilib-strict network-sandbox news parallel-fetch parallel-install pid-sandbox preserve-libs protect-owned sandbox sfperms split-log splitdebug strict strict-keepdir test unknown-features-warn unmerge-logs unmerge-orphans userfetch userpriv usersandbox usersync xattr"
FFLAGS="-O2 -pipe"
GENTOO_MIRRORS="http://distfiles.gentoo.org"
INSTALL_MASK="/usr/share/locale -/usr/share/locale/en* -/usr/share/locale/nb* -/usr/share/locale/no*"
LANG="en_GB.utf8"
LDFLAGS="-Wl,-O1 -Wl,--as-needed -Wl,--hash-style=gnu"
MAKEOPTS="-j4 -l10"
PKGDIR="/var/packages"
PORTAGE_CONFIGROOT="/"
PORTAGE_RSYNC_OPTS="--recursive --links --safe-links --perms --times --omit-dir-times --compress --force --whole-file --delete --stats --human-readable --timeout=180 --exclude=/distfiles --exclude=/local --exclude=/packages --exclude=/.git"
PORTAGE_TMPDIR="/var/tmp"
USE="X a52 aac acl alsa amd64 apng audio audiofile avresample avx bash-completion bdf bluray bzip2 cairo caps cb cdda cdparanoia cdr cjk corefonts crypt cups curl cxx declarative detex device-mapper dga dia djvu dts dvd dvi2tty dvipdfm ebook egl exif fam ffmpeg fftw fits flac fontconfig g3dvl gallium gbm gcrypt gif gimp git glamor glib gmp gnuplot gnutls gold gpm graphics graphviz gs gstreamer gtk gtk3 hardened highlight iconv icu id3tag idn imagemagick imlib inotify iproute2 ipv6 jbig jpeg jpeg2k jpg json kde kde4 kpathsea latex lcms libffi libssh2 libtirpc libv4l luatex lvm lvm2 lzma lzo man metric mikmod mkv mms mmx mng mp3 mpeg mpg123 multilib multimedia musepack ncurses netlink nptl nut ocr odbc offensive ogg opengl openmp openvg optimization optimized-qmake opus pam pango pcre pdf pgf phonon pie png postscript private-headers pstricks pth publishers python3 qt3support qt4 raw readline samba sbsms scanner science sdl seccomp smp sna sndfile speex spell split-usr sqlite sse sse2 sse3 sse4 sse41 sse4_1 sse4_2 ssh ssl ssp ssse3 svg t1lib tesseract test theora threads tiff tls truetype udev unicode usb v4l v4l2 vaapi video vorbis vpx webp wmf x264 xanim xattr xcb xcomposite xetex xft xinerama xkb xml xmlpatterns xorg xosd xpm xrandr xtpax xv xvid xvmc xz zlib zsh-completion" ABI_X86="32 64" APACHE2_MODULES="authn_core authz_core socache_shmcb unixd actions alias auth_basic authn_alias authn_anon authn_dbm authn_default authn_file authz_dbm authz_default authz_groupfile authz_host authz_owner authz_user autoindex cache cgi cgid dav dav_fs dav_lock deflate dir disk_cache env expires ext_filter file_cache filter headers include info log_config logio mem_cache mime mime_magic negotiation rewrite setenvif speling status unique_id userdir usertrack vhost_alias" CALLIGRA_FEATURES="karbon sheets words" COLLECTD_PLUGINS="df interface irq load memory rrdtool swap syslog" CPU_FLAGS_X86="mmx sse sse2 avx sse3 ssse3 sse4_1 aes avx mmxext popcnt sse3 sse4_1 sse4_2 ssse3" CURL_SSL="openssl" ELIBC="glibc" GPSD_PROTOCOLS="ashtech aivdm earthmate evermore fv18 garmin garmintxt gpsclock isync itrax mtk3301 nmea ntrip navcom oceanserver oldstyle oncore rtcm104v2 rtcm104v3 sirf skytraq superstar2 timing tsip tripmate tnt ublox ubx" GRUB_PLATFORMS="efi-64" INPUT_DEVICES="evdev synaptics" KERNEL="linux" L10N="en en-US en-GB eng" LCD_DEVICES="bayrad cfontz cfontz633 glk hd44780 lb216 lcdm001 mtxorb ncurses text" LIBREOFFICE_EXTENSIONS="presenter-console presenter-minimizer" LLVM_TARGETS="AArch64 ARM BPF X86" NETBEANS_MODULES="apisupport cnd groovy gsf harness ide identity j2ee java mobility nb php profiler soa visualweb webcommon websvccommon xml" OFFICE_IMPLEMENTATION="libreoffice" PHP_TARGETS="php5-3 php5-4" POSTGRES_TARGETS="postgres11" PYTHON_SINGLE_TARGET="python3_7" PYTHON_TARGETS="python2_7 python3_5 python3_6 python3_7" QEMU_SOFTMMU_TARGETS="x86_64 i386" SANE_BACKENDS="plustek" USERLAND="GNU" VIDEO_CARDS="intel i965 ilo" XTABLES_ADDONS="quota2 psd pknock lscan length2 ipv4options ipset ipp2p iface geoip fuzzy condition tee tarpit sysrq steal rawnat logmark ipmark dhcpmac delude chaos account"
Unset:  CC, CPPFLAGS, CTARGET, CXX, LC_ALL, LINGUAS, PORTAGE_BINHOST, PORTAGE_BUNZIP2_COMMAND, PORTAGE_COMPRESS, PORTAGE_COMPRESS_FLAGS, PORTAGE_RSYNC_EXTRA_OPTS

occam ~ # emerge -pqv '=dev-python/sqlalchemy-1.3.4::gentoo'
[ebuild     U ] dev-python/sqlalchemy-1.3.4 [1.2.9] USE="sqlite test* -doc -examples" PYTHON_TARGETS="python2_7 python3_5 python3_6 python3_7 -pypy -pypy3 (-python3_4%*)"