Gentoo Websites Logo
Go to: Gentoo Home Documentation Forums Lists Bugs Planet Store Wiki Get Gentoo!
Bug 690792 - dev-python/ipykernel-5.1.0 fails tests
Summary: dev-python/ipykernel-5.1.0 fails tests
Status: UNCONFIRMED
Alias: None
Product: Gentoo Linux
Classification: Unclassified
Component: Current packages (show other bugs)
Hardware: All Linux
: Normal normal (vote)
Assignee: Gentoo Science Related Packages
URL:
Whiteboard:
Keywords: TESTFAILURE
Depends on:
Blocks:
 
Reported: 2019-07-27 04:51 UTC by eroen
Modified: 2019-08-03 16:37 UTC (History)
1 user (show)

See Also:
Package list:
Runtime testing required: ---


Attachments
/var/log/portage/build/dev-python/ipykernel-5.1.0:20190727-044710.log (ipykernel-5.1.0:20190727-044710.log,40.53 KB, text/plain)
2019-07-27 04:51 UTC, eroen
Details

Note You need to log in before you can comment on or make changes to this bug.
Description eroen 2019-07-27 04:51:22 UTC
Created attachment 584762 [details]
/var/log/portage/build/dev-python/ipykernel-5.1.0:20190727-044710.log

======================================================================
ERROR: ipykernel.tests.test_async.test_async_interrupt
----------------------------------------------------------------------
Traceback (most recent call last):
  File "/usr/lib64/python3.5/site-packages/nose/case.py", line 197, in runTest
    self.test(*self.arg)
TypeError: test_async_interrupt() missing 2 required positional arguments: 'asynclib' and 'request'

======================================================================
FAIL: test that sys.path doesn't get messed up by default
----------------------------------------------------------------------
Traceback (most recent call last):
  File "/usr/lib64/python3.5/site-packages/nose/case.py", line 197, in runTest
    self.test(*self.arg)
  File "/var/tmp/portage/dev-python/ipykernel-5.1.0/work/ipykernel-5.1.0/ipykernel/tests/test_kernel.py", line 57, in test_sys_path
    assert stdout == "''\n"
AssertionError

======================================================================
FAIL: test that sys.path doesn't get messed up when `--profile-dir` is specified
----------------------------------------------------------------------
Traceback (most recent call last):
  File "/usr/lib64/python3.5/site-packages/nose/case.py", line 197, in runTest
    self.test(*self.arg)
  File "/var/tmp/portage/dev-python/ipykernel-5.1.0/work/ipykernel-5.1.0/ipykernel/tests/test_kernel.py", line 65, in test_sys_path_profile_dir
    assert stdout == "''\n"
AssertionError: 
-------------------- >> begin captured logging << --------------------
traitlets: DEBUG: Starting kernel: ['/usr/bin/python3.5', '-m', 'ipykernel_launcher', '-f', '/var/tmp/portage/dev-python/ipykernel-5.1.0/temp/tmp6915r3pu.json', '--profile-dir', '/var/tmp/portage/dev-python/ipykernel-5.1.0/temp/tmptn789rtr/.ipython/profile_default']
traitlets: DEBUG: Connecting to: tcp://127.0.0.1:51801
traitlets: DEBUG: connecting shell channel to tcp://127.0.0.1:42517
traitlets: DEBUG: Connecting to: tcp://127.0.0.1:42517
traitlets: DEBUG: connecting iopub channel to tcp://127.0.0.1:58039
traitlets: DEBUG: Connecting to: tcp://127.0.0.1:58039
traitlets: DEBUG: connecting stdin channel to tcp://127.0.0.1:38089
traitlets: DEBUG: Connecting to: tcp://127.0.0.1:38089
traitlets: DEBUG: connecting heartbeat channel to tcp://127.0.0.1:44101
--------------------- >> end captured logging << ---------------------

======================================================================
FAIL: ipykernel.tests.test_kernel.test_complete
----------------------------------------------------------------------
Traceback (most recent call last):
  File "/usr/lib64/python3.5/site-packages/nose/case.py", line 197, in runTest
    self.test(*self.arg)
  File "/var/tmp/portage/dev-python/ipykernel-5.1.0/work/ipykernel-5.1.0/ipykernel/tests/test_kernel.py", line 253, in test_complete
    assert c['cursor_start'] == cell.find('a.')
AssertionError

----------------------------------------------------------------------
Ran 98 tests in 99.697s

FAILED (SKIP=1, errors=1, failures=3)
 * ERROR: dev-python/ipykernel-5.1.0::gentoo failed (test phase):
 *   (no error message)
 * 
 * Call stack:
 *     ebuild.sh, line  125:  Called src_test
 *   environment, line 2677:  Called distutils-r1_src_test
 *   environment, line  910:  Called _distutils-r1_run_foreach_impl 'python_test'
 *   environment, line  356:  Called python_foreach_impl 'distutils-r1_run_phase' 'python_test'
 *   environment, line 2205:  Called multibuild_foreach_variant '_python_multibuild_wrapper' 'distutils-r1_run_phase' 'python_test'
 *   environment, line 1565:  Called _multibuild_run '_python_multibuild_wrapper' 'distutils-r1_run_phase' 'python_test'
 *   environment, line 1563:  Called _python_multibuild_wrapper 'distutils-r1_run_phase' 'python_test'
 *   environment, line  568:  Called distutils-r1_run_phase 'python_test'
 *   environment, line  841:  Called python_test
 *   environment, line 2579:  Called die
 * The specific snippet of code:
 *       nosetests --verbose ipykernel || die
Comment 1 eroen 2019-07-27 04:52:02 UTC
eroen@occam ~ $ emerge --info '=dev-python/ipykernel-5.1.0::gentoo'
Portage 2.3.69 (python 3.7.4-final-0, default/linux/amd64/17.0/hardened, gcc-9.1.0, glibc-2.28-r2, 4.19.1-gentoo-o0 x86_64)
=================================================================
                         System Settings
=================================================================
System uname: Linux-4.19.1-gentoo-o0-x86_64-Intel-R-_Core-TM-_i5-2520M_CPU_@_2.50GHz-with-gentoo-2.6
KiB Mem:     7998240 total,   3400476 free
KiB Swap:   16777212 total,  16692004 free
Timestamp of repository gentoo: Tue, 23 Jul 2019 14:30:01 +0000
Head commit of repository gentoo: ceebe130e5c00c49b9ef7e4aff83f540c8649dd2
Timestamp of repository eroen: Sun, 30 Oct 2016 21:58:42 +0000
Head commit of repository sapher: 9ef31d0bf6a902342746fb03a445d4f8b7ddabef

Head commit of repository wiktorb: 0c14c46dc4d87a4fa395bf65c132bf0a8b9d3df2

Head commit of repository gentoo-snappy: 0ea79c799ebe1bc6cd924b9dd707b710eea24e83

Head commit of repository stuff: 3ef1d8a2f83a4aacab4e13a13c6851aebfae0e8a

sh bash 5.0_p7
ld GNU ld (Gentoo 2.31.1 p7) 2.31.1
ccache version 3.5 [disabled]
app-shells/bash:          5.0_p7::gentoo
dev-java/java-config:     2.2.0-r4::gentoo
dev-lang/perl:            5.26.2::gentoo
dev-lang/python:          2.7.16::gentoo, 3.5.7::gentoo, 3.6.9::gentoo, 3.7.4-r1::gentoo
dev-util/ccache:          3.5-r1::gentoo
dev-util/cmake:           3.13.0::gentoo
dev-util/pkgconfig:       0.29.2::gentoo
sys-apps/baselayout:      2.6-r1::gentoo
sys-apps/openrc:          0.39.2::gentoo
sys-apps/sandbox:         2.13::gentoo
sys-devel/autoconf:       2.13::gentoo, 2.69-r4::gentoo
sys-devel/automake:       1.11.6-r3::gentoo, 1.13.4-r2::gentoo, 1.15.1-r2::gentoo, 1.16.1-r1::gentoo
sys-devel/binutils:       2.31.1-r6::gentoo, 2.32-r1::gentoo
sys-devel/gcc:            6.4.0-r5::gentoo, 7.3.0-r6::gentoo, 8.2.0-r4::gentoo, 9.1.0-r1::gentoo
sys-devel/gcc-config:     2.0::gentoo
sys-devel/libtool:        2.4.6-r5::gentoo
sys-devel/make:           4.2.1-r4::gentoo
sys-kernel/linux-headers: 4.19::gentoo (virtual/os-headers)
sys-libs/glibc:           2.28-r2::gentoo
Repositories:

gentoo
    location: /usr/portage
    sync-type: rsync
    sync-uri: rsync://rsync.gentoo.org/gentoo-portage
    priority: -1000
    sync-rsync-verify-jobs: 1
    sync-rsync-verify-max-age: 24
    sync-rsync-extra-opts: 
    sync-rsync-verify-metamanifest: yes

crossdev
    location: /var/lib/portage/crossdev
    masters: gentoo

eroen
    location: /usr/local/portage
    masters: gentoo
    priority: 0

sapher
    location: /var/lib/overlays/sapher
    sync-type: git
    sync-uri: https://github.com/apinsard/sapher-overlay.git
    masters: gentoo

wiktorb
    location: /var/lib/overlays/wiktorb
    sync-type: git
    sync-uri: https://github.com/wiktor-b/overlay.git
    masters: gentoo

dotnet
    location: /var/lib/layman/dotnet
    masters: gentoo
    priority: 50

enlightenment
    location: /var/lib/layman/enlightenment
    masters: gentoo
    priority: 50

flora
    location: /var/lib/layman/flora
    masters: gentoo
    priority: 50

gamerlay
    location: /var/lib/layman/gamerlay
    masters: gentoo
    priority: 50

gentoo-snappy
    location: /usr/local/portage/gentoo-snappy
    sync-type: git
    sync-uri: https://github.com/zyga/gentoo-snappy.git
    masters: gentoo
    priority: 50

glc
    location: /var/lib/layman/glc
    masters: gentoo
    priority: 50

hardened-development
    location: /var/lib/layman/hardened-development
    masters: gentoo
    priority: 50

haskell
    location: /var/lib/layman/haskell
    masters: gentoo
    priority: 50

hasufell
    location: /var/lib/layman/hasufell
    masters: gentoo
    priority: 50

java
    location: /var/lib/layman/java
    masters: gentoo
    priority: 50

laurentb
    location: /var/lib/layman/laurentb
    masters: gentoo
    priority: 50

musl
    location: /var/lib/layman/musl
    masters: gentoo
    priority: 50

roslin
    location: /var/lib/layman/roslin
    masters: gentoo
    priority: 50

stuff
    location: /var/lib/layman/stuff
    sync-type: git
    sync-uri: https://github.com/istitov/stuff.git
    masters: gentoo
    priority: 50

sunrise
    location: /var/lib/layman/sunrise
    masters: gentoo
    priority: 50

toolchain
    location: /var/lib/layman/toolchain
    masters: gentoo
    priority: 50

v-fox
    location: /var/lib/layman/v-fox
    masters: gentoo
    priority: 50

ACCEPT_KEYWORDS="amd64 ~amd64"
ACCEPT_LICENSE="*"
CBUILD="x86_64-pc-linux-gnu"
CFLAGS="-march=corei7-avx -pipe -Og -g -gdwarf-4"
CHOST="x86_64-pc-linux-gnu"
CONFIG_PROTECT="/etc /usr/share/config /usr/share/easy-rsa /usr/share/gnupg/qualified.txt"
CONFIG_PROTECT_MASK="/etc/ca-certificates.conf /etc/dconf /etc/env.d /etc/fonts/fonts.conf /etc/gconf /etc/gentoo-release /etc/revdep-rebuild /etc/sandbox.d /etc/terminfo /etc/texmf/language.dat.d /etc/texmf/language.def.d /etc/texmf/updmap.d /etc/texmf/web2c"
CXXFLAGS="-march=corei7-avx -pipe -Og -g -gdwarf-4"
DISTDIR="/var/distfiles"
EMERGE_DEFAULT_OPTS="--jobs=1 --autounmask --quiet-build --nospinner --verbose-conflicts --verbose-slot-rebuilds"
ENV_UNSET="DBUS_SESSION_BUS_ADDRESS DISPLAY GOBIN PERL5LIB PERL5OPT PERLPREFIX PERL_CORE PERL_MB_OPT PERL_MM_OPT XAUTHORITY XDG_CACHE_HOME XDG_CONFIG_HOME XDG_DATA_HOME XDG_RUNTIME_DIR"
FCFLAGS="-O2 -pipe"
FEATURES="assume-digests binpkg-docompress binpkg-dostrip binpkg-logs binpkg-multi-instance cgroup collision-protect compressdebug config-protect-if-modified distlocks ebuild-locks fixlafiles installsources ipc-sandbox merge-sync multilib-strict network-sandbox news parallel-fetch parallel-install pid-sandbox preserve-libs protect-owned sandbox sfperms split-log splitdebug strict strict-keepdir test unknown-features-warn unmerge-logs unmerge-orphans userfetch userpriv usersandbox usersync xattr"
FFLAGS="-O2 -pipe"
GENTOO_MIRRORS="http://distfiles.gentoo.org"
INSTALL_MASK="/usr/share/locale -/usr/share/locale/en* -/usr/share/locale/nb* -/usr/share/locale/no*"
LANG="en_GB.utf8"
LDFLAGS="-Wl,-O1 -Wl,--as-needed -Wl,--hash-style=gnu"
MAKEOPTS="-j4 -l10"
PKGDIR="/var/packages"
PORTAGE_CONFIGROOT="/"
PORTAGE_RSYNC_OPTS="--recursive --links --safe-links --perms --times --omit-dir-times --compress --force --whole-file --delete --stats --human-readable --timeout=180 --exclude=/distfiles --exclude=/local --exclude=/packages --exclude=/.git"
PORTAGE_TMPDIR="/var/tmp"
USE="X a52 aac acl alsa amd64 apng audio audiofile avresample avx bash-completion bdf bluray bzip2 cairo caps cb cdda cdparanoia cdr cjk corefonts crypt cups curl cxx declarative detex device-mapper dga dia djvu dts dvd dvi2tty dvipdfm ebook egl exif fam ffmpeg fftw fits flac fontconfig g3dvl gallium gbm gcrypt gif gimp git glamor glib gmp gnuplot gnutls gold gpm graphics graphviz gs gstreamer gtk gtk3 hardened highlight iconv icu id3tag idn imagemagick imlib inotify iproute2 ipv6 jbig jpeg jpeg2k jpg json kde kde4 kpathsea latex lcms libffi libssh2 libtirpc libv4l luatex lvm lvm2 lzma lzo man metric mikmod mkv mms mmx mng mp3 mpeg mpg123 multilib multimedia musepack ncurses netlink nptl nut ocr odbc offensive ogg opengl openmp openvg optimization optimized-qmake opus pam pango pcre pdf pgf phonon pie png postscript private-headers pstricks pth publishers python3 qt3support qt4 raw readline samba sbsms scanner science sdl seccomp smp sna sndfile speex spell split-usr sqlite sse sse2 sse3 sse4 sse41 sse4_1 sse4_2 ssh ssl ssp ssse3 svg t1lib tesseract test theora threads tiff tls truetype udev unicode usb v4l v4l2 vaapi video vorbis vpx webp wmf x264 xanim xattr xcb xcomposite xetex xft xinerama xkb xml xmlpatterns xorg xosd xpm xrandr xtpax xv xvid xvmc xz zlib zsh-completion" ABI_X86="32 64" APACHE2_MODULES="authn_core authz_core socache_shmcb unixd actions alias auth_basic authn_alias authn_anon authn_dbm authn_default authn_file authz_dbm authz_default authz_groupfile authz_host authz_owner authz_user autoindex cache cgi cgid dav dav_fs dav_lock deflate dir disk_cache env expires ext_filter file_cache filter headers include info log_config logio mem_cache mime mime_magic negotiation rewrite setenvif speling status unique_id userdir usertrack vhost_alias" CALLIGRA_FEATURES="karbon sheets words" COLLECTD_PLUGINS="df interface irq load memory rrdtool swap syslog" CPU_FLAGS_X86="mmx sse sse2 avx sse3 ssse3 sse4_1 aes avx mmxext popcnt sse3 sse4_1 sse4_2 ssse3" CURL_SSL="openssl" ELIBC="glibc" GPSD_PROTOCOLS="ashtech aivdm earthmate evermore fv18 garmin garmintxt gpsclock isync itrax mtk3301 nmea ntrip navcom oceanserver oldstyle oncore rtcm104v2 rtcm104v3 sirf skytraq superstar2 timing tsip tripmate tnt ublox ubx" GRUB_PLATFORMS="efi-64" INPUT_DEVICES="evdev synaptics" KERNEL="linux" L10N="en en-US en-GB eng" LCD_DEVICES="bayrad cfontz cfontz633 glk hd44780 lb216 lcdm001 mtxorb ncurses text" LIBREOFFICE_EXTENSIONS="presenter-console presenter-minimizer" LLVM_TARGETS="AArch64 ARM BPF X86" NETBEANS_MODULES="apisupport cnd groovy gsf harness ide identity j2ee java mobility nb php profiler soa visualweb webcommon websvccommon xml" OFFICE_IMPLEMENTATION="libreoffice" PHP_TARGETS="php5-3 php5-4" POSTGRES_TARGETS="postgres11" PYTHON_SINGLE_TARGET="python3_7" PYTHON_TARGETS="python2_7 python3_5 python3_6 python3_7" QEMU_SOFTMMU_TARGETS="x86_64 i386" SANE_BACKENDS="plustek" USERLAND="GNU" VIDEO_CARDS="intel i965 ilo" XTABLES_ADDONS="quota2 psd pknock lscan length2 ipv4options ipset ipp2p iface geoip fuzzy condition tee tarpit sysrq steal rawnat logmark ipmark dhcpmac delude chaos account"
Unset:  CC, CPPFLAGS, CTARGET, CXX, LC_ALL, LINGUAS, PORTAGE_BINHOST, PORTAGE_BUNZIP2_COMMAND, PORTAGE_COMPRESS, PORTAGE_COMPRESS_FLAGS, PORTAGE_RSYNC_EXTRA_OPTS

eroen@occam ~ $ emerge -pqv '=dev-python/ipykernel-5.1.0::gentoo'
[ebuild     U ] dev-python/ipykernel-5.1.0 [4.8.2] USE="test" PYTHON_TARGETS="python3_5 python3_6 python3_7%* (-python2_7%*) (-python3_4%*)"