Gentoo Websites Logo
Go to: Gentoo Home Documentation Forums Lists Bugs Planet Store Wiki Get Gentoo!
Bug 687124 - dev-libs/openssl-1.1.0k : [TEST] make: *** [Makefile:<snip>: tests] Error 2
Summary: dev-libs/openssl-1.1.0k : [TEST] make: *** [Makefile:<snip>: tests] Error 2
Status: CONFIRMED
Alias: None
Product: Gentoo Linux
Classification: Unclassified
Component: Current packages (show other bugs)
Hardware: All Linux
: Normal normal (vote)
Assignee: Gentoo's Team for Core System packages
URL:
Whiteboard:
Keywords: TESTFAILURE
Depends on:
Blocks:
 
Reported: 2019-06-01 07:26 UTC by Toralf Förster
Modified: 2019-06-01 07:27 UTC (History)
0 users

See Also:
Package list:
Runtime testing required: ---


Attachments
emerge-info.txt (emerge-info.txt,18.22 KB, text/plain)
2019-06-01 07:27 UTC, Toralf Förster
Details
dev-libs:openssl-1.1.0k:20190601-051502.log.bz2 (dev-libs:openssl-1.1.0k:20190601-051502.log.bz2,22.58 KB, application/x-bzip)
2019-06-01 07:27 UTC, Toralf Förster
Details
emerge-history.txt (emerge-history.txt,14.77 KB, text/plain)
2019-06-01 07:27 UTC, Toralf Förster
Details
environment (environment,111.80 KB, text/plain)
2019-06-01 07:27 UTC, Toralf Förster
Details
etc.portage.tbz2 (etc.portage.tbz2,11.29 KB, application/x-bzip)
2019-06-01 07:27 UTC, Toralf Förster
Details
temp.tbz2 (temp.tbz2,70.64 KB, application/x-bzip)
2019-06-01 07:27 UTC, Toralf Förster
Details

Note You need to log in before you can comment on or make changes to this bug.
Description Toralf Förster gentoo-dev 2019-06-01 07:26:56 UTC
make[1]: *** [Makefile:159: _tests] Error 1
make[1]: Leaving directory '/var/tmp/portage/dev-libs/openssl-1.1.0k/work/openssl-1.1.0k-abi_x86_64.amd64'
make: *** [Makefile:156: tests] Error 2
 * ERROR: dev-libs/openssl-1.1.0k::gentoo failed (test phase):
 *   emake failed
 * 

  -------------------------------------------------------------------

  This is an unstable amd64 chroot image at a tinderbox (==build bot)
  name: 17.1-no-multilib-hardened_test_20190531-231953

  -------------------------------------------------------------------

gcc-config -l:
 [1] x86_64-pc-linux-gnu-9.1.0 *

Available Python interpreters, in order of preference:
  [1]   python3.6
  [2]   python2.7 (fallback)





emerge -qpvO dev-libs/openssl
[ebuild     U ] dev-libs/openssl-1.1.0k [1.0.2r] USE="asm test* zlib -bindist* -rfc3779 -sctp -static-libs -tls-heartbeat* -vanilla (-gmp%) (-kerberos%) (-sslv2%) (-sslv3%*)" CPU_FLAGS_X86="(sse2)"
Comment 1 Toralf Förster gentoo-dev 2019-06-01 07:27:00 UTC
Created attachment 578290 [details]
emerge-info.txt
Comment 2 Toralf Förster gentoo-dev 2019-06-01 07:27:04 UTC
Created attachment 578294 [details]
dev-libs:openssl-1.1.0k:20190601-051502.log.bz2
Comment 3 Toralf Förster gentoo-dev 2019-06-01 07:27:09 UTC
Created attachment 578296 [details]
emerge-history.txt
Comment 4 Toralf Förster gentoo-dev 2019-06-01 07:27:14 UTC
Created attachment 578298 [details]
environment
Comment 5 Toralf Förster gentoo-dev 2019-06-01 07:27:18 UTC
Created attachment 578300 [details]
etc.portage.tbz2
Comment 6 Toralf Förster gentoo-dev 2019-06-01 07:27:22 UTC
Created attachment 578302 [details]
temp.tbz2