Gentoo Websites Logo
Go to: Gentoo Home Documentation Forums Lists Bugs Planet Store Wiki Get Gentoo!
Bug 673486 - net-analyzer/wireshark-2.9.0-r1 fails src_test: suite_decryption, suite_nameres, suite_wslua
Summary: net-analyzer/wireshark-2.9.0-r1 fails src_test: suite_decryption, suite_namer...
Status: CONFIRMED
Alias: None
Product: Gentoo Linux
Classification: Unclassified
Component: Current packages (show other bugs)
Hardware: All Linux
: Normal normal with 1 vote (vote)
Assignee: Netmon Herd
URL:
Whiteboard:
Keywords: TESTFAILURE
Depends on:
Blocks:
 
Reported: 2018-12-20 17:31 UTC by Kent Fredric (IRC: kent\n)
Modified: 2019-04-18 18:23 UTC (History)
3 users (show)

See Also:
Package list:
Runtime testing required: ---


Attachments
wireshark-2.9.0-r1:20181220-102430.log.xz (wireshark-2.9.0-r1:20181220-102430.log.xz,60.67 KB, application/x-xz)
2018-12-20 17:31 UTC, Kent Fredric (IRC: kent\n)
Details
LastTest.log.xz (LastTest.log.xz,10.64 KB, application/x-xz)
2018-12-20 17:31 UTC, Kent Fredric (IRC: kent\n)
Details
emerge install-time deps on a min-chroot (deps.txt,13.60 KB, text/plain)
2018-12-20 17:32 UTC, Kent Fredric (IRC: kent\n)
Details
wireshark-3.0.1:20190410-082730.log.gz (wireshark-3.0.1:20190410-082730.log.gz,179.74 KB, application/gzip)
2019-04-10 08:56 UTC, Paolo Pedroni
Details
LastTest.log.xz (LastTest.log.xz,11.02 KB, application/x-xz)
2019-04-10 08:59 UTC, Paolo Pedroni
Details

Note You need to log in before you can comment on or make changes to this bug.
Description Kent Fredric (IRC: kent\n) gentoo-dev 2018-12-20 17:31:05 UTC
Created attachment 558218 [details]
wireshark-2.9.0-r1:20181220-102430.log.xz

* Package:    net-analyzer/wireshark-2.9.0-r1                            
 * Repository: gentoo                                                     
 * Maintainer: netmon@gentoo.org                                          
 * USE:        abi_x86_64 amd64 capinfos captype dftest dumpcap editcap elibc_glibc filecaps kernel_linux mergecap netlink pcap python_targets_python3_6 qt5 randpkt randpktdump reordercap sharkd ssl text2pcap tshark udpdump userland_GNU zlib
 * FEATURES:   ccache preserve-libs sandbox test userpriv usersandbox

90% tests passed, 3 tests failed out of 29

Total Test time (real) =  88.86 sec

The following tests FAILED:
          3 - suite_decryption (Failed)
         25 - suite_nameres (Failed)
         29 - suite_wslua (Failed)
Errors while running CTest


 grep FAIL /var/tmp/portage/net-analyzer/wireshark-2.9.0-r1/work/wireshark-2.9.0_build/Testing/Temporary/LastTest.log

IEEE 802.11 WPA EAP (EAPOL Rekey) ... FAIL
WPA decode with message1+2 only and secure bit set on message 2 ... FAIL
IEEE 802.11 WPA PSK ... FAIL
WPA decode management frames with MFP enabled (802.11w) ... FAIL
WPA decode traffic in a TDLS (Tunneled Direct-Link Setup) session (802.11z) ... FAIL
ANSI C12.22 ... FAIL
DTLS ... FAIL
FAIL
IKEv1 (ISAKMP) simultaneous exchanges ... FAIL
IKEv1 (ISAKMP) unencrypted phase 1 ... FAIL
IKEv2 decryption test (3DES-CBC/SHA1_160) ... FAIL
IKEv2 decryption test (AES-128-CCM-12) - with CBC-MAC verification ... FAIL
IKEv2 decryption test (AES-128-CCM-12 using CTR mode, without checksum) ... FAIL
IKEv2 decryption test (AES-192-CTR/SHA2-512) ... FAIL
IKEv2 decryption test (AES-256-CBC/SHA2-256) ... FAIL
IKEv2 decryption test (AES-256-CCM-16) ... FAIL
FAIL
IKEv2 decryption test (AES-256-GCM-8) ... FAIL
IPsec ESP ... FAIL
TLS using the server's private RSA key. ... FAIL
TLS using the server's private key with password ... FAIL
FAIL: test_80211_wpa_eap (suite_decryption.case_decrypt_80211)
FAIL: test_80211_wpa_eapol_incomplete_rekeys (suite_decryption.case_decrypt_80211)
FAIL: test_80211_wpa_psk (suite_decryption.case_decrypt_80211)
FAIL: test_80211_wpa_psk_mfp (suite_decryption.case_decrypt_80211)
FAIL: test_80211_wpa_tdls (suite_decryption.case_decrypt_80211)
FAIL: test_ansi_c1222 (suite_decryption.case_decrypt_ansi_c1222)
FAIL: test_dtls_rsa (suite_decryption.case_decrypt_dtls)
FAIL: test_ikev1_certs (suite_decryption.case_decrypt_ike_isakmp)
FAIL: test_ikev1_simultaneous (suite_decryption.case_decrypt_ike_isakmp)
FAIL: test_ikev1_unencrypted (suite_decryption.case_decrypt_ike_isakmp)
FAIL: test_ikev2_3des_sha160 (suite_decryption.case_decrypt_ike_isakmp)
FAIL: test_ikev2_aes128_ccm12 (suite_decryption.case_decrypt_ike_isakmp)
FAIL: test_ikev2_aes128_ccm12_2 (suite_decryption.case_decrypt_ike_isakmp)
FAIL: test_ikev2_aes192ctr_sha512 (suite_decryption.case_decrypt_ike_isakmp)
FAIL: test_ikev2_aes256cbc_sha256 (suite_decryption.case_decrypt_ike_isakmp)
FAIL: test_ikev2_aes256ccm16 (suite_decryption.case_decrypt_ike_isakmp)
FAIL: test_ikev2_aes256gcm16 (suite_decryption.case_decrypt_ike_isakmp)
FAIL: test_ikev2_aes256gcm8 (suite_decryption.case_decrypt_ike_isakmp)
FAIL: test_ipsec_esp (suite_decryption.case_decrypt_ipsec)
FAIL: test_tls_rsa (suite_decryption.case_decrypt_tls)
FAIL: test_tls_rsa_with_password (suite_decryption.case_decrypt_tls)
FAILED (failures=21, skipped=2)
Name resolution, no external, no profile hosts, custom profile. ... FAIL
Name resolution, no external, no profile hosts, personal profile. ... FAIL
Name resolution, no external, profile hosts, custom profile. ... FAIL
FAIL
FAIL: test_name_resolution_net_t_ext_f_hosts_f_custom (suite_nameres.case_name_resolution)
FAIL: test_name_resolution_net_t_ext_f_hosts_f_personal (suite_nameres.case_name_resolution)
FAIL: test_name_resolution_net_t_ext_f_hosts_t_custom (suite_nameres.case_name_resolution)
FAIL: test_name_resolution_net_t_ext_f_hosts_t_personal (suite_nameres.case_name_resolution)
FAILED (failures=4)
FAILED (errors=25, skipped=1)

Portage 2.3.40 (python 2.7.15-final-0, default/linux/amd64/17.1/no-multilib, gcc-8.2.0, glibc-2.27-r6, 4.9.6-gentoo-r1 x86_64)
=================================================================
                         System Settings
=================================================================
System uname: Linux-4.9.6-gentoo-r1-x86_64-Intel-R-_Core-TM-2_Duo_CPU_E6750_@_2.66GHz-with-gentoo-2.6
KiB Mem:     2042732 total,    678552 free
KiB Swap:   18588764 total,  18537124 free
Head commit of repository gentoo: 9d8b61964edede957a780f6614e16581468b56da

sh bash 4.4_p12
ld GNU ld (Gentoo 2.30 p5) 2.30.0
ccache version 3.3.4 [enabled]
app-shells/bash:          4.4_p12::gentoo
dev-lang/perl:            5.28.0::gentoo
dev-lang/python:          2.7.15::gentoo, 3.6.5::gentoo
dev-util/ccache:          3.3.4-r1::gentoo
dev-util/cmake:           3.9.6::gentoo
sys-apps/baselayout:      2.6-r1::gentoo
sys-apps/openrc:          0.38.3-r1::gentoo
sys-apps/sandbox:         2.13::gentoo
sys-devel/autoconf:       2.69-r4::gentoo
sys-devel/automake:       1.15.1-r2::gentoo
sys-devel/binutils:       2.30-r4::gentoo
sys-devel/gcc:            8.2.0-r5::gentoo
sys-devel/gcc-config:     2.0::gentoo
sys-devel/libtool:        2.4.6-r3::gentoo
sys-devel/make:           4.2.1-r4::gentoo
sys-kernel/linux-headers: 4.13::gentoo (virtual/os-headers)
sys-libs/glibc:           2.27-r6::gentoo
Repositories:

gentoo
    location: /usr/portage
    sync-type: git
    sync-uri: https://github.com/gentoo/gentoo.git
    priority: -1000

ACCEPT_KEYWORDS="amd64"
ACCEPT_LICENSE="* -@EULA"
CBUILD="x86_64-pc-linux-gnu"
CFLAGS="-march=native -mtune=native -O2 -pipe"
CHOST="x86_64-pc-linux-gnu"
CONFIG_PROTECT="/etc /usr/share/gnupg/qualified.txt"
CONFIG_PROTECT_MASK="/etc/ca-certificates.conf /etc/env.d /etc/fonts/fonts.conf /etc/gconf /etc/gentoo-release /etc/sandbox.d /etc/terminfo"
CXXFLAGS="-march=native -mtune=native -O2 -pipe"
DISTDIR="/usr/portage/distfiles"
EMERGE_DEFAULT_OPTS="--quiet-build y --jobs 3 --autounmask=n"
ENV_UNSET="DBUS_SESSION_BUS_ADDRESS DISPLAY GOBIN PERL5LIB PERL5OPT PERLPREFIX PERL_CORE PERL_MB_OPT PERL_MM_OPT XAUTHORITY XDG_CACHE_HOME XDG_CONFIG_HOME XDG_DATA_HOME XDG_RUNTIME_DIR"
FCFLAGS="-O2 -pipe"
FEATURES="assume-digests binpkg-logs binpkg-multi-instance ccache clean-logs config-protect-if-modified distlocks ebuild-locks fixlafiles merge-sync multilib-strict news parallel-fetch preserve-libs protect-owned sandbox sfperms split-elog split-log strict test unknown-features-warn unmerge-logs unmerge-orphans userfetch userpriv usersandbox usersync xattr"
FFLAGS="-O2 -pipe"
GENTOO_MIRRORS="http://127.0.0.1/ http://distfiles.gentoo.org"
LANG="en_NZ.UTF-8"
LDFLAGS="-Wl,-O1 -Wl,--as-needed"
MAKEOPTS="-j3"
PKGDIR="/usr/portage/packages"
PORTAGE_CONFIGROOT="/"
PORTAGE_RSYNC_OPTS="--recursive --links --safe-links --perms --times --omit-dir-times --compress --force --whole-file --delete --stats --human-readable --timeout=180 --exclude=/distfiles --exclude=/local --exclude=/packages --exclude=/.git"
PORTAGE_TMPDIR="/var/tmp"
USE="acl amd64 berkdb bzip2 cli crypt cxx dri fortran gdbm iconv ipv6 libtirpc minimal ncurses nls nptl openmp pam pcre perl readline seccomp ssl tcpd unicode xattr zlib" ABI_X86="64" ALSA_CARDS="ali5451 als4000 atiixp atiixp-modem bt87x ca0106 cmipci emu10k1x ens1370 ens1371 es1938 es1968 fm801 hda-intel intel8x0 intel8x0m maestro3 trident usb-audio via82xx via82xx-modem ymfpci" APACHE2_MODULES="authn_core authz_core socache_shmcb unixd actions alias auth_basic authn_alias authn_anon authn_dbm authn_default authn_file authz_dbm authz_default authz_groupfile authz_host authz_owner authz_user autoindex cache cgi cgid dav dav_fs dav_lock deflate dir disk_cache env expires ext_filter file_cache filter headers include info log_config logio mem_cache mime mime_magic negotiation rewrite setenvif speling status unique_id userdir usertrack vhost_alias" CALLIGRA_FEATURES="karbon plan sheets stage words" COLLECTD_PLUGINS="df interface irq load memory rrdtool swap syslog" CPU_FLAGS_X86="mmx mmxext sse sse2 sse3 ssse3" ELIBC="glibc" GPSD_PROTOCOLS="ashtech aivdm earthmate evermore fv18 garmin garmintxt gpsclock isync itrax mtk3301 nmea ntrip navcom oceanserver oldstyle oncore rtcm104v2 rtcm104v3 sirf skytraq superstar2 timing tsip tripmate tnt ublox ubx" KERNEL="linux" LCD_DEVICES="bayrad cfontz cfontz633 glk hd44780 lb216 lcdm001 mtxorb ncurses text" LIBREOFFICE_EXTENSIONS="presenter-console presenter-minimizer" LLVM_TARGETS="X86" OFFICE_IMPLEMENTATION="libreoffice" PHP_TARGETS="php5-6 php7-1" POSTGRES_TARGETS="postgres9_5 postgres10" PYTHON_SINGLE_TARGET="python3_6" PYTHON_TARGETS="python2_7 python3_6" RUBY_TARGETS="ruby23 ruby24" USERLAND="GNU" XTABLES_ADDONS="quota2 psd pknock lscan length2 ipv4options ipset ipp2p iface geoip fuzzy condition tee tarpit sysrq steal rawnat logmark ipmark dhcpmac delude chaos account"
Unset:  CC, CPPFLAGS, CTARGET, CXX, INSTALL_MASK, LC_ALL, LINGUAS, PORTAGE_BINHOST, PORTAGE_BUNZIP2_COMMAND, PORTAGE_COMPRESS, PORTAGE_COMPRESS_FLAGS, PORTAGE_RSYNC_EXTRA_OPTS

=================================================================
                        Package Settings
=================================================================

net-analyzer/wireshark-2.9.0-r1::gentoo was built with the following:
USE="capinfos captype dftest dumpcap editcap filecaps mergecap netlink pcap qt5 randpkt randpktdump reordercap sharkd ssl text2pcap tshark udpdump zlib -adns -androiddump -bcg729 -ciscodump -doc -kerberos -libxml2 -lua -lz4 -maxminddb -nghttp2 -sbc (-selinux) -smi -snappy -spandsp -sshdump -tfshark" PYTHON_TARGETS="python3_6 -python3_4 -python3_5 -python3_7"
CXXFLAGS="-march=native -mtune=native -O2 -pipe -fPIC -DPIC"
Comment 1 Kent Fredric (IRC: kent\n) gentoo-dev 2018-12-20 17:31:40 UTC
Created attachment 558220 [details]
LastTest.log.xz
Comment 2 Kent Fredric (IRC: kent\n) gentoo-dev 2018-12-20 17:32:33 UTC
Created attachment 558222 [details]
emerge install-time deps on a min-chroot
Comment 3 Paolo Pedroni 2019-04-10 08:52:20 UTC
Same thing happens with wireshark-3.0.1 (except suite_wslua test, but that may be because I have USE=lua).
Comment 4 Paolo Pedroni 2019-04-10 08:56:23 UTC
Created attachment 572374 [details]
wireshark-3.0.1:20190410-082730.log.gz

# emerge --info =net-analyzer/wireshark-3.0.1
Portage 2.3.62 (python 3.6.5-final-0, default/linux/amd64/17.1/desktop, gcc-8.3.0, glibc-2.28-r6, 4.19.27-gentoo-r1 x86_64)
=================================================================
                         System Settings
=================================================================
System uname: Linux-4.19.27-gentoo-r1-x86_64-AMD_Phenom-tm-_II_X4_965_Processor-with-gentoo-2.6
KiB Mem:    12264780 total,   3818272 free
KiB Swap:    8351740 total,   8295768 free
Timestamp of repository gentoo: Wed, 10 Apr 2019 06:45:01 +0000
Head commit of repository gentoo: 85a97a49b212176fa49d1d0c56b4f2d3068f273f
sh dash 0.5.9.1-r3
ld GNU gold (Gentoo 2.31.1 p5 2.31.1) 1.16
distcc 3.3.2 x86_64-pc-linux-gnu [enabled]
ccache version 3.3.4 [disabled]
app-shells/bash:          4.4_p23-r1::gentoo
dev-java/java-config:     2.2.0-r4::gentoo
dev-lang/perl:            5.26.2::gentoo
dev-lang/python:          2.7.15::gentoo, 3.6.5::gentoo
dev-util/ccache:          3.3.4-r1::gentoo
dev-util/cmake:           3.9.6::gentoo
dev-util/pkgconfig:       0.29.2::gentoo
sys-apps/baselayout:      2.6-r1::gentoo
sys-apps/sandbox:         2.13::gentoo
sys-devel/autoconf:       2.13-r1::gentoo, 2.69-r4::gentoo
sys-devel/automake:       1.16.1-r1::gentoo
sys-devel/binutils:       2.31.1-r4::gentoo
sys-devel/gcc:            8.3.0-r1::gentoo
sys-devel/gcc-config:     2.0::gentoo
sys-devel/libtool:        2.4.6-r3::gentoo
sys-devel/make:           4.2.1-r4::gentoo
sys-kernel/linux-headers: 4.17::gentoo (virtual/os-headers)
sys-libs/glibc:           2.28-r6::gentoo
Repositories:

gentoo
    location: /usr/portage
    sync-type: rsync
    sync-uri: rsync://rsync.europe.gentoo.org/gentoo-portage
    priority: -1000
    sync-rsync-verify-max-age: 24
    sync-rsync-extra-opts: 
    sync-rsync-verify-jobs: 1
    sync-rsync-verify-metamanifest: yes

x-portage
    location: /usr/local/portage
    masters: gentoo
    priority: 0

ACCEPT_KEYWORDS="amd64"
ACCEPT_LICENSE="* -@EULA"
CBUILD="x86_64-pc-linux-gnu"
CFLAGS="-O2 -pipe -frecord-gcc-switches -march=amdfam10 -flto=5"
CHOST="x86_64-pc-linux-gnu"
CONFIG_PROTECT="/etc /usr/lib64/libreoffice/program/sofficerc /usr/share/config /usr/share/gnupg/qualified.txt"
CONFIG_PROTECT_MASK="/etc/ca-certificates.conf /etc/dconf /etc/env.d /etc/fonts/fonts.conf /etc/gconf /etc/gentoo-release /etc/revdep-rebuild /etc/sandbox.d /etc/terminfo"
CXXFLAGS="-O2 -pipe -frecord-gcc-switches -march=amdfam10 -flto=5"
DISTDIR="/usr/portage/distfiles"
EMERGE_DEFAULT_OPTS="--keep-going y --with-bdeps y"
ENV_UNSET="DBUS_SESSION_BUS_ADDRESS DISPLAY GOBIN PERL5LIB PERL5OPT PERLPREFIX PERL_CORE PERL_MB_OPT PERL_MM_OPT XAUTHORITY XDG_CACHE_HOME XDG_CONFIG_HOME XDG_DATA_HOME XDG_RUNTIME_DIR"
FCFLAGS="-O2 -pipe -frecord-gcc-switches -march=amdfam10 -flto=5"
FEATURES="assume-digests binpkg-docompress binpkg-dostrip binpkg-logs cgroup compress-build-logs config-protect-if-modified distcc distlocks ebuild-locks ipc-sandbox merge-sync multilib-strict network-sandbox news parallel-fetch pid-sandbox preserve-libs protect-owned sandbox sfperms split-elog split-log strict test unknown-features-warn unmerge-logs unmerge-orphans userfetch userpriv usersandbox usersync xattr"
FFLAGS="-O2 -pipe -frecord-gcc-switches -march=amdfam10 -flto=5"
GENTOO_MIRRORS="http://gentoo.modulix.net/gentoo/ http://mirror.netcologne.de/gentoo/ http://ftp.halifax.rwth-aachen.de/gentoo/ http://mirrors.evowise.com/gentoo/ http://gentoo.mirrors.ovh.net/gentoo-distfiles/"
LANG="it_IT.UTF-8"
LDFLAGS="-Wl,-O1 -Wl,--as-needed -Wl,--hash-style=gnu -Wl,--sort-common -flto=5"
LINGUAS="it it_IT"
MAKEOPTS="-j15 -l4"
PKGDIR="/usr/portage/packages"
PORTAGE_CONFIGROOT="/"
PORTAGE_RSYNC_OPTS="--recursive --links --safe-links --perms --times --omit-dir-times --compress --force --whole-file --delete --stats --human-readable --timeout=180 --exclude=/distfiles --exclude=/local --exclude=/packages --exclude=/.git"
PORTAGE_TMPDIR="/var/tmp"
USE="3dnow X a52 aac aalib acl acpi alsa amd64 ao audiofile bash-completion bluetooth branding bzip2 cairo caps cdda cddb cdparanoia cdr cli consolekit crypt css cups curl cxx dbus dga djvu dri dts dvd dvdr emboss encode exif expat fbcon ffmpeg fftw flac fontconfig fortran ftp gd gdbm gif glamor gmp gnutls gpm graphviz gtk iconv icu idn ieee1394 imagemagick imlib inotify introspection ipv6 java jbig jpeg jpeg2k kde lame lcms libass libcaca libnotify libsamplerate libtirpc lm_sensors lua lzma lzo mad mmap mng mp3 mp4 mpeg mplayer multilib musicbrainz ncurses nls nptl nsplugin offensive ogg openal opengl openmp pam pango pcre pdf png policykit postscript ppds pulseaudio qt5 rdesktop readline samba sctp sdl seccomp sndfile speex spell sqlite ssl startup-notification svg symlink syslog systemd taglib test theora threads tiff truetype udev udisks unicode upower usb vaapi vcd vdpau vim-syntax vorbis wavpack wayland win32codecs wmf wxwidgets x264 xattr xcb xcomposite xine xinerama xml xpm xscreensaver xv xvid zlib" ABI_X86="64" ALSA_CARDS="hda-intel virmidi" APACHE2_MODULES="authn_core authz_core socache_shmcb unixd actions alias auth_basic authn_alias authn_anon authn_dbm authn_default authn_file authz_dbm authz_default authz_groupfile authz_host authz_owner authz_user autoindex cache cgi cgid dav dav_fs dav_lock deflate dir disk_cache env expires ext_filter file_cache filter headers include info log_config logio mem_cache mime mime_magic negotiation rewrite setenvif speling status unique_id userdir usertrack vhost_alias" CALLIGRA_FEATURES="karbon sheets words" CAMERAS="kodak ptp2" COLLECTD_PLUGINS="df interface irq load memory rrdtool swap syslog" CPU_FLAGS_X86="3dnow 3dnowext mmx mmxext popcnt sse sse2 sse3 sse4a" CURL_SSL="gnutls" ELIBC="glibc" GPSD_PROTOCOLS="ashtech aivdm earthmate evermore fv18 garmin garmintxt gpsclock isync itrax mtk3301 nmea ntrip navcom oceanserver oldstyle oncore rtcm104v2 rtcm104v3 sirf skytraq superstar2 timing tsip tripmate tnt ublox ubx" GRUB_PLATFORMS="pc" INPUT_DEVICES="libinput" KERNEL="linux" L10N="it en" LCD_DEVICES="bayrad cfontz cfontz633 glk hd44780 lb216 lcdm001 mtxorb ncurses text" NETBEANS_MODULES="apisupport cnd groovy gsf harness ide identity j2ee java mobility nb php profiler soa visualweb webcommon websvccommon xml" OFFICE_IMPLEMENTATION="libreoffice" PHP_TARGETS="php5-6 php7-1" POSTGRES_TARGETS="postgres9_5 postgres10" PYTHON_SINGLE_TARGET="python3_6" PYTHON_TARGETS="python2_7 python3_6 pypy pypy3" USERLAND="GNU" VIDEO_CARDS="radeon r600" XTABLES_ADDONS="quota2 psd pknock lscan length2 ipv4options ipset ipp2p iface geoip fuzzy condition tee tarpit sysrq steal rawnat logmark ipmark dhcpmac delude chaos account"
Unset:  CC, CPPFLAGS, CTARGET, CXX, INSTALL_MASK, LC_ALL, PORTAGE_BINHOST, PORTAGE_BUNZIP2_COMMAND, PORTAGE_COMPRESS, PORTAGE_COMPRESS_FLAGS, PORTAGE_RSYNC_EXTRA_OPTS

# emerge -1pqv =net-analyzer/wireshark-3.0.1
[ebuild     U ] net-analyzer/wireshark-3.0.1 [2.6.7] USE="adns capinfos captype dftest dumpcap editcap filecaps libxml2 lua lz4 mergecap netlink nghttp2 pcap qt5 randpkt randpktdump reordercap sdjournal%* sharkd smi snappy sshdump ssl text2pcap tshark udpdump zlib -androiddump -bcg729 -ciscodump -doc -dpauxmon% -kerberos -maxminddb -sbc (-selinux) -spandsp -tfshark (-gtk%) (-portaudio%)" PYTHON_TARGETS="python3_6%* -python3_5% (-python3_7)"
Comment 5 Paolo Pedroni 2019-04-10 08:59:23 UTC
Created attachment 572376 [details]
LastTest.log.xz
Comment 6 Thomas Deutschmann gentoo-dev Security 2019-04-10 17:04:08 UTC
(In reply to Paolo Pedroni from comment #3)
> Same thing happens with wireshark-3.0.1 (except suite_wslua test, but that
> may be because I have USE=lua).

Same on x86.